program: Orca
programVersion: 4.2.1
elementType: C O O C H H C H H C H H H C C C C C C H H H H H
charge: 0
multiplicity: 1
keywords: RKS wB97M-V def2-TZVPP def2-TZVPP/C def2/J RIJCOSX TightSCF GRID6 CPCM NBO
formula: C10H12O2
InChI: InChI=1S/C10H12O2/c1-2-12-10(11)8-9-6-4-3-5-7-9/h3-7H,2,8H2,1H3
24 atoms
C  1.201977 -0.195504 -0.033458
O  0.995593 -1.151812 0.675216
O  2.419331 0.321842 -0.24437
C  0.166664 0.563353 -0.826986
H  0.41233 1.633598 -0.787678
H  0.324736 0.272253 -1.88002
C  3.514954 -0.339197 0.414341
H  3.328693 -0.33714 1.499689
H  3.533827 -1.394329 0.099102
C  4.778217 0.381458 0.056047
H  4.747786 1.429967 0.382569
H  5.636672 -0.098255 0.543633
H  4.954783 0.366999 -1.028168
C  -1.249849 0.30805 -0.41137
C  -1.823547 -0.961894 -0.563815
C  -2.027928 1.330653 0.143364
C  -3.139277 -1.200371 -0.173241
C  -3.346742 1.09531 0.534384
C  -3.906171 -0.171904 0.377849
H  -1.227524 -1.771243 -0.993891
H  -1.592135 2.326356 0.269007
H  -3.570916 -2.196516 -0.300581
H  -3.938674 1.907547 0.963946
H  -4.938753 -0.359201 0.682941
elementType: C O H
totalener: -538.76801771 hartree
nucrepener: 655.22969577 hartree
electener: -1193.99771348 hartree
oneelecener: -2029.98958714 hartree
twoeener: 835.99187366 hartree
cpcmener: -0.01221871 hartree
kineticenergy: 537.00112458 hartree
exchangeener: -50.771448796215 hartree
correlationener: -2.785895939819 hartree
xcener: -53.222826930774 hartree
chargesum: -0.0000000
charge: 0.350844 -0.373639 -0.260280 -0.176624 0.120886 0.150040 -0.025007 0.116313 0.117313 -0.309336 0.107797 0.109508 0.107382 0.037638 -0.157015 -0.174719 -0.158502 -0.154949 -0.160570 0.134258 0.143370 0.152119 0.150426 0.152747
charge: -0.428886 0.092704 0.286768 -0.011261 0.048244 0.056068 -0.095582 0.018562 0.018478 -0.009123 0.017424 0.023940 0.017297 -0.080376 -0.003970 -0.011362 -0.026037 -0.027176 -0.029706 0.031533 0.029853 0.028073 0.027758 0.026777
qa: 0.3508 -0.3736 -0.2603 -0.1766 0.1209 0.1500 -0.0250 0.1163 0.1173 -0.3093 0.1078 0.1095 0.1074 0.0376 -0.1570 -0.1747 -0.1585 -0.1549 -0.1606 0.1343 0.1434 0.1521 0.1504 0.1527
va: 4.2143 2.1309 2.0950 3.7541 1.0153 0.9870 3.8041 0.9802 0.9804 3.9045 0.9894 0.9926 0.9895 3.6242 3.8963 3.8891 3.8818 3.8857 3.8745 1.0059 0.9939 0.9880 0.9886 0.9872
energy: -538.768017707919
dipole: 7.77482 -7.11211 0.66271 1.77843 -1.17841 0.60002 -0.54618 0.06947 -0.47672
magnitude: 1.01315 au
magnitude: 2.57523 debye
