program: Orca
programVersion: 4.2.1
elementType: C O O C C C C C C H H H H H H H H H H H C H H H
charge: 0
multiplicity: 1
keywords: RKS wB97M-V def2-TZVPP def2-TZVPP/C def2/J RIJCOSX TightSCF GRID6 CPCM NBO
formula: C8H14O2
InChI: InChI=1S/C8H14O2/c1-7(9)10-8-5-3-2-4-6-8/h8H,2-6H2,1H3
24 atoms
C  -2.27887 -0.101266 0.158752
O  -2.21402 -0.971864 0.996214
O  -1.210046 0.558322 -0.318761
C  0.999413 1.383124 0.028903
C  0.089713 0.183191 0.188782
C  0.61949 -1.031208 -0.552184
C  2.034616 -1.36336 -0.100455
C  2.962267 -0.166457 -0.250211
C  2.414313 1.0512 0.48025
H  0.591118 2.237093 0.590819
H  1.002784 1.680023 -1.034719
H  -0.024085 -0.066509 1.258445
H  -0.05627 -1.885632 -0.39785
H  0.611612 -0.807477 -1.633817
H  2.417072 -2.228754 -0.663083
H  2.012508 -1.677939 0.958375
H  3.971732 -0.412373 0.114516
H  3.076054 0.073577 -1.322841
H  3.070755 1.922828 0.335382
H  2.411262 0.852598 1.567121
C  -3.533296 0.388808 -0.487033
H  -3.621141 1.478132 -0.385199
H  -3.508557 0.174407 -1.564064
H  -4.408198 -0.095835 -0.043533
elementType: C O H
totalener: -463.75702841 hartree
nucrepener: 563.63578800 hartree
electener: -1027.39281641 hartree
oneelecener: -1746.72555772 hartree
twoeener: 719.33274132 hartree
cpcmener: -0.00697897 hartree
kineticenergy: 462.24029711 hartree
exchangeener: -43.819311319539 hartree
correlationener: -2.430675646175 hartree
xcener: -45.956488192976 hartree
chargesum: -0.0000000
charge: 0.359986 -0.395041 -0.275139 -0.178810 0.087985 -0.197752 -0.208555 -0.192179 -0.204896 0.103916 0.103108 0.106939 0.109471 0.104479 0.103364 0.105669 0.103819 0.097575 0.102753 0.102965 -0.320017 0.131818 0.134691 0.113850
charge: -0.447969 0.075788 0.296944 -0.029703 -0.147444 -0.028847 -0.031535 -0.036928 -0.031595 0.024992 0.028612 0.026408 0.023822 0.027959 0.022517 0.025950 0.020884 0.024167 0.022450 0.025670 0.013421 0.032768 0.034677 0.026994
qa: 0.3600 -0.3950 -0.2751 -0.1788 0.0880 -0.1978 -0.2086 -0.1922 -0.2049 0.1039 0.1031 0.1069 0.1095 0.1045 0.1034 0.1057 0.1038 0.0976 0.1028 0.1030 -0.3200 0.1318 0.1347 0.1139
va: 4.1762 2.1043 2.0798 3.7787 3.7309 3.7330 3.8026 3.7860 3.7977 1.0031 1.0044 1.0164 1.0141 1.0044 0.9956 0.9920 0.9950 0.9943 0.9957 0.9938 3.8394 0.9895 0.9866 1.0045
energy: -463.757028405357
dipole: 7.71881 -7.31192 0.40689 1.27497 -0.64630 0.62868 -2.27646 1.65171 -0.62476
magnitude: 0.97525 au
magnitude: 2.47889 debye
