program: Orca
programVersion: 4.2.1
elementType: O C O C H H H C H H C H H H
charge: 0
multiplicity: 1
keywords: RKS wB97M-V def2-TZVPP def2-TZVPP/C def2/J RIJCOSX TightSCF GRID6 CPCM NBO
formula: C4H8O2
InChI: InChI=1S/C4H8O2/c1-3-6-4(2)5/h3H2,1-2H3
14 atoms
O  -0.173048 -0.442526 -0.000105
C  1.035638 0.143266 -0.000443
O  1.189619 1.342707 -0.000177
C  2.124817 -0.877997 -0.000023
H  2.032973 -1.535716 -0.874434
H  2.043872 -1.52122 0.886285
H  3.105083 -0.392367 -0.009358
C  -1.306421 0.441189 0.000527
H  -1.246981 1.097988 -0.881795
H  -1.247192 1.096159 0.884216
C  -2.550492 -0.393667 -0.000271
H  -3.438674 0.251428 -0.000229
H  -2.601034 -1.036809 -0.889594
H  -2.601867 -1.037656 0.888426
elementType: O C H
totalener: -307.71515404 hartree
nucrepener: 244.11926426 hartree
electener: -551.83441830 hartree
oneelecener: -901.55711903 hartree
twoeener: 349.72270073 hartree
cpcmener: -0.00706379 hartree
kineticenergy: 306.75291016 hartree
exchangeener: -28.047763323830 hartree
correlationener: -1.521505271975 hartree
xcener: -29.381411371098 hartree
energy: -527.1383 -525.6338 -285.0211 -282.8386 -281.4618 -281.1749 -33.5806 -31.1408 -24.6453 -23.2331 -20.3470 -18.4719 -16.5092 -16.4216 -15.8310 -14.8506 -13.9492 -13.5815 -13.1811 -13.0597 -12.2602 -12.2000 -10.9273 -10.3817 2.7176 2.8000 3.3856 4.1638 4.5507 4.8596 5.0994 5.5159 5.5254 5.5842 5.9498 6.4037 7.1312 7.6915 7.7726 8.0123 8.3345 9.0707 9.1041 10.2018 10.6885 10.7880 11.7770 12.2221 12.6515 12.8621 13.2825 13.3153 13.4162 13.9343 14.1464 14.1623 14.4429 14.8500 15.1851 15.9996 16.0540 16.4746 17.4659 17.6794 17.7566 18.6557 19.1052 19.8496 21.6277 21.7166 22.3475 22.9440 23.7580 24.2802 24.5731 25.3002 25.4037 26.2999 26.5327 26.7751 27.7188 27.7936 28.3952 28.8292 29.4614 29.5742 29.9867 30.3066 31.2330 31.4279 32.6897 32.7620 33.6969 34.2747 34.3081 35.1013 35.8799 36.5057 36.8612 37.7040 38.7122 39.4050 39.4788 40.3164 40.3493 40.6764 40.7208 40.8927 41.4857 41.7778 42.3960 42.6069 43.1029 44.1021 44.1095 44.8521 45.3045 46.1615 46.7441 46.8927 49.4366 51.7863 52.2187 54.8215 55.1462 55.7730 57.0075 57.5199 57.9758 58.3664 59.3700 60.8958 61.8163 62.1681 64.4515 64.9611 66.2051 66.8596 68.8485 69.1201 69.7264 70.3005 70.5067 70.9519 71.4820 71.7644 73.6558 74.5188 74.8168 75.7105 75.9671 77.1541 77.7584 78.3469 78.8324 79.0499 79.7304 80.1625 81.1323 81.2579 81.5736 82.5886 82.8393 83.3405 83.4101 83.9509 84.4326 84.9253 85.4918 86.0515 86.4892 87.0103 87.4082 88.2843 88.6103 88.7492 90.1784 90.7314 91.6843 91.9377 92.2439 92.5383 92.7623 93.4593 94.7288 95.2385 96.1897 96.2245 96.7005 96.7419 96.9657 97.4841 98.6709 99.1955 100.2221 100.5023 101.2366 101.5945 102.6638 104.4019 104.5691 104.6923 105.7451 105.8351 106.1612 106.4478 107.6465 107.8246 108.9429 109.4648 109.7756 109.8735 109.8929 111.1977 112.2439 112.4927 112.8909 113.0756 113.1429 113.7233 114.4935 115.5351 116.9841 117.6698 117.7521 118.6792 119.6735 119.9150 120.5476 120.6021 121.6497 123.3100 124.6701 125.2175 125.4650 127.2961 127.9816 128.4049 129.5049 130.6967 131.5023 131.7523 133.0770 133.5558 135.0976 135.6734 137.6758 138.6043 140.0395 141.5236 141.5641 142.3446 143.3995 143.5375 144.2163 144.8433 145.3996 145.5986 145.6918 146.0260 146.4035 147.2554 148.6876 149.2363 150.6446 150.9858 151.8615 153.3940 153.7894 153.9458 154.0824 154.7205 155.4382 157.0073 161.9032 165.8169 167.8493 170.2565 172.7787 173.5006 176.6998 177.8562 181.1982 185.3599 186.8745 188.2186 190.5604 192.2649 195.4672 197.2383 203.5690 206.0543 638.8591 644.7251 650.1286 650.7122 1206.1008 1216.7037 electronvolt
chargesum: -0.0000000
charge: -0.264715 0.355787 -0.389374 -0.306196 0.133080 0.133218 0.114162 -0.021649 0.115715 0.115671 -0.306076 0.107965 0.105867 0.106546
charge: 0.280921 -0.449185 0.075445 0.013743 0.034037 0.034227 0.027433 -0.099405 0.017692 0.017674 -0.009923 0.023358 0.016954 0.017029
qa: -0.2647 0.3558 -0.3894 -0.3062 0.1331 0.1332 0.1142 -0.0216 0.1157 0.1157 -0.3061 0.1080 0.1059 0.1065
va: 2.0526 4.1730 2.1132 3.8304 0.9891 0.9888 1.0038 3.8032 0.9820 0.9821 3.8985 0.9929 0.9902 0.9900
energy: -307.715154039103
dipole: -4.02904 3.57655 -0.45249 -3.13500 2.27311 -0.86189 0.00359 -0.00253 0.00106
magnitude: 0.97345 au
magnitude: 2.47432 debye
