program: Orca
programVersion: 4.2.1
elementType: O C O C H H C H H H O C C C C C C H H H H H H H H H C H C H H H C H H H C H H H
charge: 0
multiplicity: 1
keywords: RKS wB97M-V def2-TZVPP def2-TZVPP/C def2/J RIJCOSX TightSCF GRID6 CPCM NBO
formula: C13H24O3
InChI: InChI=1S/C13H24O3/c1-9(2)11-6-5-10(3)7-12(11)16-8-13(14)15-4/h9-12H,5-8H2,1-4H3
40 atoms
O  3.989742 -1.192506 -0.229846
C  3.017104 -0.348979 0.148737
O  3.209734 0.778624 0.526289
C  1.676865 -1.02134 -0.002171
H  1.740099 -2.037973 0.433108
H  1.513965 -1.175105 -1.089304
C  5.313273 -0.66956 -0.188467
H  5.587749 -0.367071 0.830988
H  5.417092 0.199458 -0.852287
H  5.976544 -1.471753 -0.525673
O  0.686002 -0.236996 0.567995
C  -1.400221 0.890744 0.381429
C  -0.590552 -0.328567 -0.044612
C  -1.300677 -1.630214 0.289382
C  -2.680739 -1.706113 -0.357471
C  -3.498703 -0.477376 0.029166
C  -2.776544 0.824852 -0.279666
H  -1.558177 0.796326 1.474707
H  -0.45296 -0.289856 -1.149208
H  -0.684074 -2.487414 -0.0298
H  -1.39773 -1.70783 1.388218
H  -2.531785 -1.671885 -1.455176
H  -4.478335 -0.502539 -0.475918
H  -3.716644 -0.525696 1.112739
H  -3.392639 1.676939 0.045811
H  -2.666634 0.93249 -1.374729
C  -0.637568 2.211028 0.157237
H  0.238785 2.164691 0.825394
C  -1.4657 3.419427 0.565099
H  -2.284454 3.622309 -0.14341
H  -1.917983 3.291364 1.560884
H  -0.847698 4.328864 0.602249
C  -0.099316 2.368767 -1.257414
H  0.386558 3.34801 -1.383477
H  0.658121 1.60781 -1.4977
H  -0.89334 2.307389 -2.019561
C  -3.394549 -2.999457 -0.014408
H  -2.812841 -3.882164 -0.319247
H  -3.566926 -3.082073 1.070751
H  -4.376554 -3.066544 -0.505908
elementType: O C H
totalener: -735.50207281 hartree
nucrepener: 1210.82969806 hartree
electener: -1946.33177087 hartree
oneelecener: -3403.45125969 hartree
twoeener: 1457.11948882 hartree
cpcmener: -0.01041136 hartree
kineticenergy: 733.06198027 hartree
exchangeener: -69.924158581830 hartree
correlationener: -3.903146028729 hartree
xcener: -73.361262843005 hartree
chargesum: -0.0000000
charge: -0.269548 0.335971 -0.364342 -0.049917 0.134287 0.121965 -0.200496 0.135716 0.135048 0.140115 -0.294128 -0.032887 -0.004150 -0.242801 0.003947 -0.236489 -0.239339 0.099952 0.127589 0.110530 0.108210 0.086063 0.104730 0.107996 0.114526 0.113618 0.027479 0.078008 -0.393731 0.106671 0.118332 0.116485 -0.385036 0.110132 0.111594 0.112588 -0.380757 0.111349 0.109033 0.111685
charge: 0.279161 -0.444070 0.098429 -0.145307 0.028501 0.035185 -0.043208 0.011171 0.011140 0.013662 0.264883 -0.074727 -0.180092 -0.018794 -0.104142 -0.025932 -0.017970 0.039371 0.028406 0.026000 0.030669 0.032640 0.023453 0.027754 0.025261 0.026397 -0.105297 0.029130 -0.005202 0.013885 0.016580 0.014573 -0.001117 0.016103 0.014048 0.012824 -0.001948 0.015568 0.017251 0.015761
qa: -0.2695 0.3360 -0.3643 -0.0499 0.1343 0.1220 -0.2005 0.1357 0.1350 0.1401 -0.2941 -0.0329 -0.0042 -0.2428 0.0039 -0.2365 -0.2393 0.1000 0.1276 0.1105 0.1082 0.0861 0.1047 0.1080 0.1145 0.1136 0.0275 0.0780 -0.3937 0.1067 0.1183 0.1165 -0.3850 0.1101 0.1116 0.1126 -0.3808 0.1113 0.1090 0.1117
va: 2.0716 4.2233 2.1448 3.8465 0.9836 0.9809 3.8509 0.9772 0.9771 0.9811 1.9750 3.7153 3.8592 3.7281 3.7274 3.7767 3.7941 1.0093 0.9722 1.0009 1.0090 0.9977 0.9979 0.9957 0.9932 0.9923 3.7092 1.0232 3.8554 0.9812 0.9862 0.9904 3.8532 0.9919 0.9883 0.9879 3.8774 0.9900 0.9883 0.9897
energy: -735.502072808363
dipole: -16.51518 16.48348 -0.03171 2.07014 -3.17396 -1.10381 -3.58888 2.82375 -0.76513
magnitude: 1.34344 au
magnitude: 3.41475 debye
