program: Gaussian 16
title: E088
version: ES64L-G16RevC.01
frameworkgroup: C1[X(C11H12O2)]
method: RM06L
basis: def2SVP/W06
operation: Freq
keyword: #P
keyword: Geom=AllCheck
keyword: Guess=TCheck
keyword: SCRF=Check
keyword: GenChk
keyword: RM06L/def2SVP/W06
keyword: Freq
converged: YES YES YES YES
polarizability: 1.91096795e+02 -1.41132022e+01 1.44519159e+02 1.19689111e+01 2.31943907e+01 1.09076459e+02
1716.lowfreq: -4.6575 -0.0008 0.0002 0.0006 9.3154 21.7986 34.6924 72.0435 84.8631
frequency: 33.8422 71.6995 84.7289 158.7917 197.4324 227.9782 241.3699 292.1945 359.6728 417.0174 471.4433 519.4024 583.9158 619.0152 631.9196 676.1320 713.8418 720.8021 737.1556 796.7026 828.0104 861.0850 881.6244 909.8997 949.7931 980.4922 992.6898 1010.9418 1014.8638 1029.6687 1058.0366 1066.5686 1092.9289 1125.9237 1135.0967 1153.9077 1172.5280 1188.8506 1198.7356 1219.2049 1226.2158 1244.9359 1282.6545 1327.9276 1334.9891 1357.3213 1390.2600 1404.1677 1412.3516 1419.6416 1444.1543 1477.2800 1480.9632 1534.0956 1649.5315 1676.1488 1891.7955 3020.8203 3030.5256 3051.2180 3058.4789 3085.3895 3144.6973 3149.9292 3160.8887 3172.8688 3181.4557 3193.2412 3201.1247
redmass: 4.0501 4.9557 4.4266 3.9074 4.4471 2.2522 2.6494 4.8337 3.1935 2.9180 2.7655 4.9719 5.4396 3.1538 4.4320 3.3280 3.2346 1.6075 2.6184 3.2770 3.8525 1.2502 1.6970 1.4945 1.5393 2.0836 1.3662 1.3249 4.7809 2.2047 2.1265 4.4198 1.7320 2.0904 1.8832 1.0594 1.8950 1.1482 1.4761 1.5511 1.9038 1.2244 1.2863 1.4819 1.4146 1.7468 1.6699 1.9441 3.2205 1.3088 1.1726 1.1094 2.4714 2.5722 6.1752 6.3408 12.8089 1.0820 1.0656 1.0669 1.0666 1.1016 1.1041 1.1052 1.0878 1.0867 1.0933 1.0970 1.0963
irintensity: 1.8796 4.4721 1.2912 0.8084 2.7672 1.8862 5.8517 0.8305 4.9819 0.1184 7.4345 11.4423 3.6278 5.5353 4.0408 9.1153 5.9672 46.6444 29.1537 11.5169 2.3037 0.1735 13.0883 2.1419 3.9402 15.7008 0.0464 0.1520 0.6506 15.5564 10.4549 108.0802 18.1908 26.1395 16.9379 0.1416 232.1926 5.3245 16.0968 84.4291 33.1366 9.2480 4.5615 4.1601 3.5355 5.8156 22.5046 47.4048 9.8626 28.2779 21.6173 10.3126 6.8264 20.0453 1.8829 17.8476 513.5152 3.4656 37.3477 63.4951 39.5727 14.0886 21.6990 25.9958 14.5319 0.1494 32.8916 44.4108 13.5009
temp: 298.150 k
press: 1.00000 atm
elementType: 8 6 6 6 6 1 1 1 8 1 1 6 1 1 6 6 6 6 6 6 1 1 1 1 1
symmnumber: 1
zpe: 546878.7 jmol-1
zpe.correction: 0.208295 hartree
zpe.thermalcorrener: 0.219076 hartree
zpe.thermalcorrenthalpy: 0.220020 hartree
zpe.thermalcorrgfe: 0.170597 hartree
zpe.sumelectzpe: -576.179079 hartree
zpe.sumelectthermal: -576.168298 hartree
zpe.sumelectthermalent: -576.167354 hartree
zpe.sumelectthermalfe: -576.216777 hartree
hfenergy: -576.3873746 hartree
pointgroup: C01 [X(C11H12O2)]
dipole: 0.1897266 -1.8729403 1.1089121 debye
dipolederiv: -0.4111103 0.3146464 0.1005369 0.3370571 -1.6225759 -0.1449853 0.2141358 -0.5537947 -0.9904759 0.4196001 -0.4800663 -0.050418 -0.4563642 2.2605301 0.0152092 -0.190152 0.4251507 1.5128619 0.4344974 -0.0919223 -0.0301649 -0.1465765 0.8475045 -0.0138729 0.0709256 -0.3004331 0.4559763 0.1377544 0.0509864 0.1173437 0.0439436 0.0627285 -0.1267407 0.0521084 -0.0089985 -0.0067832 0.1258814 -0.0326076 -0.0777696 -0.0091432 0.0022493 0.1338932 -0.0243627 0.0646247 -0.2893052 -0.0960536 -0.0345866 -0.0051223 -0.0493547 0.060136 0.0174129 -0.0196165 -0.0132676 0.0379138 -0.1531458 -0.0792035 0.0194697 -0.0074767 0.0279957 -0.0192068 -0.0088731 -0.0250321 0.0403938 0.0522651 -0.0639862 -0.0551495 0.0064295 -0.089172 -0.07101 -0.0143563 -0.1133068 -0.0478775 -0.4539409 0.2321925 -0.0180351 0.2391873 -1.516783 0.1219526 -0.0134679 0.2593407 -0.8329748 -0.1769755 0.091253 0.0346938 -0.0069424 -0.0236329 0.0057524 -0.0124845 0.0687978 0.0364368 0.0682019 0.0654812 -0.0667595 0.0191631 -0.0273345 0.0702733 -0.0240917 0.1129372 -0.0314983 0.1454064 -0.1691372 -0.0647109 -0.0537688 0.0137921 0.004455 -0.0118929 0.1150913 0.2290087 -0.1066634 -0.0103099 -0.0287546 0.0120342 -0.031678 -0.0712857 -0.1058446 -0.1297792 -0.0003238 0.0950846 0.0349035 0.0450297 -0.0330272 -0.1360131 0.0178765 0.0540445 0.0325814 -0.0957199 -0.0423412 0.1932445 0.0959857 0.11147 0.4614211 0.1769652 0.0453122 0.147334 0.0154695 0.0647346 0.1100489 -0.0606321 0.0380794 -0.1783103 -0.0387511 -0.1007624 -0.0832163 -0.1429462 -0.0474911 -0.1464806 -0.1099567 -0.0125821 -0.2053122 -0.0148003 -0.0769899 0.0779875 -0.0179993 0.0407324 -0.0054648 -0.0956676 0.0278571 -0.0053763 0.0556027 -0.0809652 0.069286 -0.0626028 0.0615106 0.0773029 -0.0687762 0.0502281 0.052517 0.0508509 -0.0982253 0.0466375 -0.0659395 -0.1123217 0.0471488 -0.0063069 0.0283245 -0.0211786 0.0503983 -0.0059309 0.0372651 -0.1279162 -0.0701357 -0.0992923 0.0604464 -0.1193483 0.0317687 0.0155622 0.0518754 0.007459 0.1086057 0.0109329 0.0827323 0.0910158 0.0643138 0.0646583 -0.0651362 0.1195703 -0.0722894 0.0359693 -0.0113031 0.0662404 0.1114725 0.0596758 0.0423331 -0.0777852 0.1077281 -0.0814509 0.0399561 -0.0682358 -0.1104889 0.0562137 -0.0982444 0.0339967 0.0031104 0.0668708 0.011098 0.1053064 0.0931163 -0.0426346 0.0060163 -0.0449351 -0.1042642 -0.0957406 0.0054449 -0.0940224 0.0944642 unknown
polarizability: 142.0194883|7.3007953|181.9051628|-23.6493407|31.5691225|120.7677616 unknown
InChI: InChI=1S/C11H12O2/c12-11-10(6-7-13-11)8-9-4-2-1-3-5-9/h1-5,10H,6-8H2
charge 0 multiplicity 1
25 atoms
O  -0.90120738 0.6286265 -7.14721641
C  -1.20666678 1.62863682 -6.29148928
C  -0.69443721 -0.60312484 -6.43147055
C  -1.38282512 -0.40031216 -5.09931077
C  -1.19616683 1.09331432 -4.87243815
H  -0.16743205 1.26065257 -4.49844182
H  -2.45631115 -0.63639797 -5.18030626
H  -1.10172663 -1.41937094 -7.04074282
O  -1.44258655 2.743171 -6.67804484
H  0.39051478 -0.76401535 -6.32264249
H  -0.96382952 -1.02715024 -4.30208022
C  -2.1983832 1.74592559 -3.93891806
H  -3.19347779 1.73193361 -4.41647018
H  -2.3107975 1.09364423 -3.05588643
C  -1.90595422 3.14210073 -3.45451221
C  -2.85307423 3.78045157 -2.63784752
C  -0.72638267 3.83438374 -3.75319085
C  -2.63112188 5.05958359 -2.13492492
C  -0.49898628 5.1165999 -3.24940624
C  -1.447828 5.73564176 -2.43843256
H  -3.78294754 3.25670093 -2.39454307
H  0.0283465 3.38220967 -4.40015514
H  -3.3868076 5.53285196 -1.50247769
H  0.42913206 5.63651476 -3.50087097
H  -1.26955011 6.74031933 -2.0472235
