program: Gaussian 16
title: E087
version: ES64L-G16RevC.01
frameworkgroup: C1[X(C11H12O3)]
method: RM06L
basis: def2SVP/W06
operation: Freq
keyword: #P
keyword: Geom=AllCheck
keyword: Guess=TCheck
keyword: SCRF=Check
keyword: GenChk
keyword: RM06L/def2SVP/W06
keyword: Freq
converged: YES YES NO YES
polarizability: 2.07288764e+02 1.22145378e+01 1.44174856e+02 -5.25366593e+00 2.00906945e+01 1.16672603e+02
1716.lowfreq: -9.3370 -1.9525 0.0008 0.0009 0.0011 12.0099 33.2452 55.3607 82.9791
frequency: 31.5858 55.2614 82.9638 112.9537 159.9306 194.6520 229.2714 257.7010 269.5266 288.3783 382.9338 429.2600 464.7524 485.1626 531.1756 569.1520 593.7721 646.9998 668.5592 712.8732 748.4680 801.7330 822.2675 829.7335 845.1041 874.6396 941.7836 953.5276 974.8655 978.9628 1010.9609 1023.3292 1048.4123 1064.5412 1111.3662 1121.1938 1164.0187 1173.1797 1179.8292 1195.8266 1196.4272 1216.7758 1237.7541 1286.7769 1297.3042 1307.0970 1314.3982 1367.3125 1394.8644 1411.6591 1441.1486 1441.6296 1452.7710 1459.8693 1470.9593 1476.2220 1561.1760 1642.4387 1688.8668 1897.4314 3009.0007 3027.1914 3052.6321 3061.7996 3113.1763 3144.8172 3152.2314 3164.6752 3167.7888 3178.8013 3197.3983 3210.9562
redmass: 4.1357 4.4912 4.3497 4.0497 4.1600 3.1308 2.3288 1.4452 3.2665 3.3199 6.1937 3.0329 3.8618 4.0229 3.2935 3.0609 4.6039 6.0256 2.9929 7.3283 4.0190 3.9310 1.3603 2.5622 2.0986 1.9454 2.4344 1.4792 1.3587 2.0050 1.8829 2.4905 5.8721 4.6013 1.6528 1.7155 1.2984 2.1624 1.1358 1.3903 1.4796 1.6176 1.3659 1.4953 2.1696 1.9530 1.4199 2.6290 1.6788 4.4801 1.0464 1.1419 1.1993 1.2376 2.5720 1.1060 3.1062 7.2684 6.7526 12.9462 1.0344 1.0835 1.0663 1.0665 1.1079 1.1054 1.1050 1.0908 1.0901 1.1040 1.0952 1.0932
irintensity: 4.6107 4.2805 1.8601 4.2586 2.3080 2.4282 1.0021 0.7290 1.5053 1.4806 4.4594 0.0176 6.9034 2.1638 10.4237 21.0038 26.1627 1.9415 7.9405 7.2574 1.2167 6.6107 16.9683 25.9183 35.8075 1.1832 19.4910 1.7595 0.6032 17.4815 7.0788 1.5216 128.7015 107.7922 17.4354 46.0969 1.3301 235.8513 26.7623 11.9831 13.8590 63.1043 26.3219 26.8658 230.8231 147.9177 52.5295 23.0679 63.7719 13.8185 11.0202 20.5617 47.6987 15.5640 11.7116 7.3665 233.6092 14.2515 102.1077 487.0902 98.4187 14.7982 67.1728 30.6916 38.6309 22.2681 20.8312 19.3742 17.9456 16.6006 11.2440 5.5290
temp: 298.150 k
press: 1.00000 atm
elementType: 8 6 6 6 6 1 1 1 8 1 1 6 6 6 6 6 6 1 1 1 1 8 6 1 1 1
symmnumber: 1
zpe: 556705.9 jmol-1
zpe.correction: 0.212038 hartree
zpe.thermalcorrener: 0.224156 hartree
zpe.thermalcorrenthalpy: 0.225100 hartree
zpe.thermalcorrgfe: 0.172499 hartree
zpe.sumelectzpe: -651.320725 hartree
zpe.sumelectthermal: -651.308608 hartree
zpe.sumelectthermalent: -651.307664 hartree
zpe.sumelectthermalfe: -651.360265 hartree
hfenergy: -651.5327633 hartree
pointgroup: C01 [X(C11H12O3)]
dipole: -0.2126767 -1.2882031 1.3643303 debye
dipolederiv: -0.4043774 0.2952955 -0.050679 0.4554666 -1.657544 0.0213797 0.1600728 -0.4038941 -0.9285688 0.3971662 -0.4245077 0.207949 -0.5276919 2.1334068 -0.2334458 -0.107316 0.2671522 1.5861083 0.4815599 -0.1517476 -0.0089718 -0.1137667 0.6917172 -0.1053197 0.0967526 -0.3197806 0.5798416 0.0625356 0.1092409 0.144439 0.0390938 0.0256959 -0.1310592 0.1064903 -0.061282 -0.0360709 0.2247758 -0.0489839 -0.204877 0.0354192 0.0891011 -0.0082639 -0.0967618 -0.0119764 -0.2916997 -0.0953969 -0.0225018 0.050057 -0.0496271 0.0206113 0.0023115 -0.0052363 -0.0241389 0.026971 -0.1319865 -0.0656443 0.0601656 -0.0164114 0.0321815 -0.001164 0.0144369 -0.0146208 0.0439383 0.0411646 -0.0737631 -0.0350106 0.0118687 -0.1276296 -0.0548614 0.0031223 -0.0913939 -0.0131866 -0.4859491 0.2762319 -0.0886125 0.250643 -1.2477451 0.3454829 -0.0621052 0.3905624 -1.0064404 -0.1820065 0.0996281 0.0391843 -0.0099986 0.0022283 0.0158513 0.0133183 0.0617619 0.009113 0.0510894 0.0618398 -0.0906462 0.0199094 0.0233038 0.0469529 -0.053312 0.0923687 -0.0518532 -0.142485 -0.1659106 -0.1822165 -0.138658 0.0013146 0.1267035 -0.1442332 0.1100488 -0.036984 0.2455363 0.0331519 0.1238739 -0.1251706 -0.0520827 0.0515046 -0.0887715 0.1232994 0.0437802 0.1057917 -0.0401355 -0.0205394 0.0414636 0.0140159 0.1804046 0.1153615 0.1697858 0.1198226 -0.0948318 -0.0918072 -0.0740594 0.2459128 -0.3104939 -0.0412213 0.3613784 -0.1221691 -0.2954552 -0.3116162 0.2759032 0.3166365 0.0291903 -0.2052993 0.0187573 0.0042766 0.0676678 -0.1137116 0.8969799 -0.5495392 -0.5263223 -0.8156349 0.7693103 0.5466631 -0.9004389 0.6288179 0.775618 0.077633 -0.0402876 -0.0466676 -0.026385 0.0496985 -0.1022455 -0.0582904 -0.115565 -0.0326848 -0.1324211 0.0120838 -0.0440639 0.0243477 0.1178074 -0.0140293 -0.0288353 -0.0149882 0.1056576 -0.0682593 0.0291853 -0.0233109 0.0190965 0.1419779 -0.0305422 -0.0322271 -0.0309093 0.1218522 0.0816259 -0.0118871 -0.0342886 -0.0292317 0.0667846 -0.1187289 -0.0491136 -0.1164976 -0.0071284 -1.7284034 0.7288569 0.5787421 0.7933036 -0.8974734 -0.5225485 0.699965 -0.5653323 -0.8766588 1.336033 -0.3988962 -0.2674012 -0.0669225 0.3745955 -0.0166544 0.1488707 -0.096285 0.2842573 -0.0847438 0.0598795 0.0768826 0.021564 0.0269598 0.0637097 -0.1393568 0.1428478 -0.0683744 -0.1169538 0.0534387 0.0644346 -0.1523251 -0.0931586 0.0575105 -0.0392773 0.041043 0.0804618 -0.0224605 0.0508764 0.0353021 0.0845443 0.010716 -0.0971472 0.0812302 -0.1065223 -0.0186051 unknown
polarizability: 173.6509266|-29.4778044|148.2418253|-10.070072|39.1806745|146.2434709 unknown
InChI: InChI=1S/C11H12O3/c1-13-9-4-2-8(3-5-9)10-6-7-14-11(10)12/h2-5,10H,6-7H2,1H3
charge 0 multiplicity 1
26 atoms
O  -1.02745723 0.39283488 -7.24421876
C  -1.2946815 1.57003946 -6.6396221
C  -0.66917924 -0.60836777 -6.27398955
C  -1.22191789 -0.09761094 -4.96188653
C  -1.10201596 1.4145906 -5.13778368
H  -0.05041125 1.70861309 -4.96000682
H  -2.28217064 -0.37674955 -4.85378962
H  -1.08878931 -1.56561264 -6.60700854
O  -1.61044296 2.54862818 -7.26144894
H  0.42908473 -0.69982667 -6.26002884
H  -0.68405794 -0.48752252 -4.08878173
C  -1.99610668 2.27214528 -4.29208829
C  -3.37150321 2.33855111 -4.5365644
C  -1.48917614 3.00442954 -3.20959218
C  -4.22205735 3.10412409 -3.74000575
C  -2.3199075 3.77064041 -2.40217483
C  -3.69709631 3.82793551 -2.66043464
H  -3.79909956 1.78268908 -5.37709982
H  -0.41649526 2.9742124 -2.99620438
H  -5.28834288 3.13417771 -3.96901394
H  -1.92024143 4.34059976 -1.56066149
O  -4.43486646 4.59733616 -1.83029707
C  -5.82131424 4.6818983 -2.06397271
H  -6.04753201 5.11020534 -3.05402568
H  -6.31423156 3.69925174 -1.98276862
H  -6.23225541 5.34417372 -1.29409109
