program: Gaussian 16
title: E80
version: ES64L-G16RevC.01
frameworkgroup: C1[X(C10H10O2)]
method: RM06L
basis: def2SVP/W06
operation: Freq
keyword: #P
keyword: Geom=AllCheck
keyword: Guess=TCheck
keyword: SCRF=Check
keyword: GenChk
keyword: RM06L/def2SVP/W06
keyword: Freq
converged: YES YES YES YES
polarizability: 1.72119444e+02 -1.18493325e+01 1.44608525e+02 1.17174413e+01 1.52126459e+01 8.63463251e+01
1716.lowfreq: -7.8018 -0.0011 -0.0007 -0.0007 11.7581 14.4999 39.8239 92.3145 126.7328
frequency: 38.6875 92.2921 126.7008 188.3544 236.4335 274.2726 349.7164 415.4185 431.7587 503.6154 562.4481 626.2600 635.2002 675.4495 714.2282 719.7775 752.9087 828.1957 852.3806 875.9998 926.6813 944.9497 982.6828 988.3762 1012.1449 1015.1644 1021.4741 1056.2655 1067.0620 1091.2070 1126.8447 1155.5163 1177.5222 1183.2817 1200.5616 1225.5128 1237.3377 1278.3095 1303.5795 1326.9139 1384.8537 1394.7156 1408.9312 1444.3856 1475.8305 1479.2260 1533.0000 1648.8250 1676.3924 1895.4700 3002.9405 3053.9664 3067.7243 3148.5798 3153.8934 3172.0564 3179.5679 3187.5270 3194.2144 3199.6702
redmass: 4.2040 4.5346 5.1468 3.7703 2.3613 4.7629 5.2003 2.8620 3.7412 3.3094 4.7185 5.6819 4.3158 3.3544 1.4783 5.5559 2.9304 2.6899 1.2558 1.9634 1.4869 2.5378 2.1154 1.3774 1.3008 5.0404 1.9621 2.0087 4.3241 1.6454 2.0825 1.0637 1.4560 1.5138 1.4566 1.6001 1.4990 1.4885 1.5546 1.3720 2.0237 1.7787 5.8079 1.1618 1.1578 2.2787 2.6630 6.3673 6.4585 12.9123 1.0829 1.0668 1.0651 1.1047 1.1062 1.0847 1.0886 1.0930 1.0965 1.1001
irintensity: 2.7811 2.1296 4.2725 1.6862 0.8350 4.5118 1.4976 0.1939 3.4295 11.9191 12.7596 2.9084 12.3864 7.4496 52.0957 10.7448 15.1018 17.0212 0.1911 2.4926 5.9533 10.7540 18.1738 0.1917 0.1129 0.1100 10.1098 14.9970 104.8826 5.7704 36.8704 0.1424 124.5583 149.6898 17.2398 82.5583 8.4015 48.0998 2.4687 5.1254 6.8575 68.4696 2.0898 17.9447 10.0772 8.4913 25.0281 1.1381 10.8361 482.2189 8.9241 68.4089 24.7072 20.4371 22.5830 0.9654 4.7206 26.7999 35.1066 10.6536
temp: 298.150 k
press: 1.00000 atm
elementType: 6 6 8 6 6 1 1 1 1 1 8 6 6 6 6 6 6 1 1 1 1 1
symmnumber: 1
zpe: 472065.9 jmol-1
zpe.correction: 0.179800 hartree
zpe.thermalcorrener: 0.189282 hartree
zpe.thermalcorrenthalpy: 0.190226 hartree
zpe.thermalcorrgfe: 0.144028 hartree
zpe.sumelectzpe: -536.926941 hartree
zpe.sumelectthermal: -536.917460 hartree
zpe.sumelectthermalent: -536.916516 hartree
zpe.sumelectthermalfe: -536.962713 hartree
hfenergy: -537.1067415 hartree
pointgroup: C01 [X(C10H10O2)]
dipole: 0.3713926 -1.0439863 -1.7015779 debye
dipolederiv: -0.051668 0.0353587 -0.1047152 0.1234118 0.103842 0.0531208 -0.0225663 0.0170514 0.0438779 0.505158 -0.0703171 -0.0145879 -0.1978409 0.5805374 0.1254157 -0.2780386 0.2689906 0.706114 -1.6426721 0.6370679 0.2741999 0.3370434 -0.5948773 -0.2985787 -0.0329531 -0.2297235 -0.844013 1.9824395 -0.6706567 -0.2759634 -0.3227792 0.7456814 0.680192 0.1688973 0.4603783 1.5162829 -0.0444919 -0.0471238 -0.1809388 -0.0685413 0.0421816 -0.1370645 -0.3462278 -0.0250921 -0.2286819 0.0667342 -0.0121534 -0.0287313 -0.0051592 0.0128481 -0.1247575 0.0174941 -0.0815737 -0.0469979 -0.1557993 0.0236832 0.038751 -0.0731212 0.0488971 0.0013562 0.0363586 -0.0222982 0.0266446 0.0440547 -0.0176009 0.0022717 0.0992114 -0.1783059 0.0159578 0.0207748 0.0488737 -0.031481 -0.0288396 0.0223695 0.0060402 0.0390138 -0.0544848 0.0862073 0.0130958 0.0569775 0.0268064 0.0372178 -0.0162557 0.0118537 -0.0324704 -0.0887404 0.1096517 0.0157938 0.0516216 0.0125349 -0.8699713 0.2633268 0.1228242 0.2334506 -0.6719467 -0.4297439 0.2263468 -0.4187905 -1.2302829 0.3212971 -0.2290691 0.1588214 -0.2657864 0.1252029 -0.1405674 0.1491088 -0.1239653 0.0069289 -0.0962289 -0.0059768 -0.0858398 0.0289787 -0.1394456 0.0190756 -0.1282156 0.0356781 -0.0645376 -0.1672481 0.0363239 -0.0020629 0.0394096 -0.12327 -0.0208085 0.044185 -0.1109002 0.0785081 -0.0131121 -0.0494838 -0.0174719 -0.0553362 -0.0775692 -0.0849427 -0.0177225 -0.0909828 0.0746013 0.0279232 -0.0553985 -0.0859745 -0.053 -0.0982762 -0.0189388 -0.0859262 -0.0351737 0.0311913 -0.0300902 -0.0717042 0.0117055 -0.065985 -0.0852018 -0.0440122 0.0221384 -0.0391767 -0.0683517 -0.0091387 0.029213 0.1203547 0.0347547 0.1254288 -0.0136643 0.1146066 -0.0085838 0.0303531 0.1270444 0.0195527 -0.0235938 0.020928 0.071366 0.075998 0.014308 0.0947965 -0.0404813 0.0891882 0.0213163 0.0030865 0.0277532 0.0798715 0.096807 -0.0088687 0.105063 -0.0891879 -0.0437609 0.0404267 0.1118913 0.0400733 0.1168298 0.0026139 0.1189877 -0.0022232 0.0078739 -0.048036 0.1171013 -0.0419204 0.1159912 0.0594313 0.0466823 -0.0415767 0.0490531 0.0822978 unknown
polarizability: 157.4536137|-37.13529|106.0578693|-9.0891697|-16.8774981|139.5628107 unknown
InChI: InChI=1S/C10H10O2/c11-10-9(6-7-12-10)8-4-2-1-3-5-8/h1-5,9H,6-7H2
charge 0 multiplicity 1
22 atoms
C  1.44345006 3.9577381 -4.14414194
C  2.54903383 3.55324313 -3.19474951
O  2.25715244 4.25130056 -1.96932657
C  0.95842483 4.61022402 -1.92427576
C  0.26893166 4.12230201 -3.19446986
H  1.27684616 3.22552551 -4.94425143
H  3.55712563 3.84262151 -3.51495254
H  2.5500433 2.47135359 -2.98521861
H  -0.09662411 3.11347956 -2.9138023
H  1.69169192 4.92132909 -4.61547904
O  0.4902105 5.19626414 -0.98578133
C  -0.91379889 4.9426115 -3.62763519
C  -0.97774279 5.54395622 -4.8900231
C  -2.00192434 5.10207101 -2.75584359
C  -2.09244298 6.29456869 -5.26812388
C  -3.1128108 5.85304583 -3.13137138
C  -3.16210446 6.45516786 -4.38993358
H  -0.15324466 5.42469565 -5.59717997
H  -1.97111134 4.63128139 -1.77058923
H  -2.12218151 6.75414527 -6.25930264
H  -3.94907804 5.96638229 -2.43675499
H  -4.03472371 7.04259094 -4.68593041
