program: Gaussian 16
title: E69
version: ES64L-G16RevC.01
frameworkgroup: C1[X(C11H21NO4)]
method: RM06L
basis: def2SVP/W06
operation: Freq
keyword: #P
keyword: Geom=AllCheck
keyword: Guess=TCheck
keyword: SCRF=Check
keyword: GenChk
keyword: RM06L/def2SVP/W06
keyword: Freq
converged: YES YES YES YES
polarizability: 1.89573982e+02 4.69381907e+00 1.66421599e+02 9.61094716e-01 -2.57136489e+00 1.51976928e+02
1716.lowfreq: -0.0013 -0.0012 -0.0009 7.5235 9.0031 15.9095 24.0276 31.3265 55.6914
frequency: 23.8159 31.1670 55.5895 79.0781 83.8466 99.7191 114.5561 146.7553 168.9446 180.9988 215.3765 217.3020 221.7621 248.9231 255.5559 282.7380 284.6075 287.4731 326.1461 337.5905 349.9341 353.5889 367.1909 410.3081 417.7567 429.3851 455.9980 464.5186 497.8817 573.8030 654.8194 744.1739 782.5965 786.5278 837.2803 857.6169 901.7762 911.6596 918.9696 931.4652 933.1811 948.1879 964.1577 968.9798 1020.3343 1036.6481 1050.6679 1064.5666 1134.4324 1156.8614 1163.0569 1170.6217 1182.9176 1193.8152 1217.7860 1226.7430 1268.0759 1275.1097 1286.0780 1302.6641 1330.7148 1351.9387 1366.3324 1374.5367 1378.7032 1380.5657 1388.2319 1389.1956 1417.5845 1434.0650 1435.5912 1436.4898 1436.9909 1442.0917 1443.8707 1446.0093 1450.0983 1450.2965 1456.1599 1460.4945 1465.8294 1538.6886 1808.2369 1851.8316 3028.0109 3031.0891 3040.1054 3041.2619 3044.5782 3046.4710 3051.6557 3057.2285 3133.2354 3134.9136 3154.6000 3155.6935 3157.1486 3159.2213 3162.4765 3170.1094 3170.4085 3186.6766 3193.3603 3200.2000 3660.2788
redmass: 3.4620 3.5830 3.1687 3.2543 4.6826 4.7110 2.8753 3.2541 1.4596 2.0269 1.3194 1.2522 1.8399 1.2909 1.1391 2.5795 1.6643 1.6494 3.1375 3.2416 2.5846 2.7126 3.8985 1.2719 2.5913 2.5968 2.6635 2.8753 3.4984 3.7448 3.7972 6.6190 9.4093 4.7671 3.5601 2.3820 3.1902 3.3113 1.1803 1.5139 1.5806 1.2091 1.4962 2.3188 2.3314 1.4318 1.6619 3.6133 2.3652 2.1147 1.3108 2.2736 1.8429 1.5567 2.1576 2.3159 2.1849 2.3167 2.1293 1.7941 1.4377 1.8099 1.4764 1.4638 1.4243 1.4493 1.3631 1.3025 1.0412 1.0372 1.0425 1.0535 1.0545 1.0583 1.0674 1.1521 1.0701 1.0976 1.2323 1.0820 1.0686 2.4329 11.2148 12.1912 1.0403 1.0424 1.0713 1.0433 1.0385 1.0394 1.0405 1.0846 1.1025 1.1016 1.1031 1.1037 1.1036 1.1080 1.1047 1.1039 1.1021 1.1031 1.1026 1.1075 1.0794
irintensity: 2.3477 0.8643 1.0075 1.1383 7.9783 0.4164 7.5815 1.8131 2.6674 1.8387 2.0808 0.9894 0.9921 0.5495 1.3622 7.1379 2.9102 1.8549 6.9796 13.2468 9.3961 11.7822 21.9527 120.0962 6.2481 1.2989 14.0217 5.2951 3.0453 15.1403 12.4292 12.2955 32.2125 16.5705 14.1358 9.2937 20.9436 34.7781 7.4446 0.7415 3.5322 0.1824 2.5865 29.2671 71.4056 0.3010 23.1838 65.8882 43.0204 24.7031 0.6403 522.0630 26.5953 2.3077 20.9997 194.1782 37.0205 153.1965 90.0083 182.9083 75.7499 207.3835 25.0784 46.2114 49.1534 6.2361 19.2573 19.6353 0.2806 13.3376 0.0844 1.8267 2.7768 4.5053 32.0865 13.6102 10.4020 1.7398 15.8726 16.2382 4.7020 641.2046 333.3051 349.4904 49.1750 63.6698 23.6418 21.8523 34.9599 53.6155 19.4216 28.9378 8.0077 74.2245 33.7102 14.8680 27.4464 24.3778 29.7733 30.2119 17.1717 9.8440 10.2986 12.9293 100.2386
temp: 298.150 k
press: 1.00000 atm
elementType: 6 8 8 6 1 1 1 6 1 6 1 7 1 6 8 8 6 6 1 1 1 6 1 1 1 6 1 1 1 6 1 1 1 6 1 1 1
symmnumber: 1
zpe: 836114.0 jmol-1
zpe.correction: 0.318459 hartree
zpe.thermalcorrener: 0.337588 hartree
zpe.thermalcorrenthalpy: 0.338532 hartree
zpe.thermalcorrgfe: 0.270985 hartree
zpe.sumelectzpe: -786.546632 hartree
zpe.sumelectthermal: -786.527503 hartree
zpe.sumelectthermalent: -786.526559 hartree
zpe.sumelectthermalfe: -786.594106 hartree
hfenergy: -786.8650907 hartree
pointgroup: C01 [X(C11H21N1O4)]
dipole: -0.060353 -1.6004561 0.7836007 debye
polarizability: 177.7293899|12.4415409|162.8270254|-13.2467268|0.8674449|167.4160938 unknown
InChI: InChI=1S/C11H21NO4/c1-7(2)8(9(13)15-6)12-10(14)16-11(3,4)5/h7-8,12H,1-6H3
charge 0 multiplicity 1
37 atoms
C  -0.27666611 1.40774693 -2.89243357
O  -0.1204666 2.5722003 -3.16781671
O  -0.52419992 0.96960607 -1.64966049
C  -0.72781954 1.98164784 -0.67271528
H  0.15700081 2.62444262 -0.57024217
H  -1.5901188 2.60962751 -0.93722405
H  -0.92319465 1.46799896 0.27376982
C  -0.16570255 0.23952164 -3.87060913
H  0.80365929 -0.24312931 -3.65126149
C  -0.13774424 0.72321384 -5.33490908
H  -0.90908239 1.50657798 -5.43065082
N  -1.17048898 -0.75865188 -3.5817649
H  -0.88934484 -1.70104996 -3.34192886
C  -2.46346293 -0.39195636 -3.37977602
O  -2.86148202 0.75085157 -3.52819752
O  -3.19541645 -1.45243805 -3.00956384
C  -4.61780247 -1.30466164 -2.66744598
C  -4.76648062 -0.3630963 -1.48539841
H  -5.80806278 -0.36987275 -1.1343347
H  -4.13061012 -0.68592898 -0.64823022
H  -4.50129712 0.66763939 -1.74738825
C  -5.0167593 -2.71633086 -2.28267348
H  -4.86179667 -3.41180587 -3.11906848
H  -4.42716344 -3.07425964 -1.42734206
H  -6.07835807 -2.75043016 -2.0033708
C  -5.39809767 -0.83735853 -3.88270063
H  -5.22146675 -1.50369163 -4.73920739
H  -6.47475525 -0.85717902 -3.66199636
H  -5.1270501 0.1838623 -4.17357843
C  1.21533299 1.33279272 -5.66813015
H  2.01021211 0.56971118 -5.6317056
H  1.21949515 1.75605191 -6.6829572
H  1.48982039 2.13794628 -4.97504692
C  -0.4690448 -0.4009077 -6.30118263
H  0.21946583 -1.25348391 -6.18183849
H  -1.49074102 -0.78297918 -6.17037698
H  -0.37934187 -0.05454067 -7.34090061
