program: Gaussian 16
title: E59
version: ES64L-G16RevC.01
frameworkgroup: C1[X(C7H7NO2)]
method: RM06L
basis: def2SVP/W06
operation: Freq
keyword: #P
keyword: Geom=AllCheck
keyword: Guess=TCheck
keyword: SCRF=Check
keyword: GenChk
keyword: RM06L/def2SVP/W06
keyword: Freq
converged: YES YES YES YES
polarizability: 1.50179276e+02 3.18189134e+00 1.16343537e+02 6.84928574e-06 -6.95431390e-03 5.29113664e+01
1716.lowfreq: -14.2759 -10.5068 -0.0005 -0.0005 0.0005 10.3545 48.2337 107.9266 151.2941
frequency: 48.1757 107.8698 151.2519 162.4624 206.1601 329.7935 364.6498 410.3552 454.4495 500.1223 626.3879 716.6247 721.3384 761.1621 850.0776 862.0360 926.9290 990.3661 1016.2466 1020.1081 1028.8015 1068.5411 1105.4479 1145.9602 1160.8570 1162.1801 1209.0833 1304.2511 1340.1839 1384.2373 1433.5003 1442.3579 1454.1477 1471.1507 1510.7958 1642.5033 1653.5109 1827.9246 3046.6275 3143.3605 3164.1366 3187.1394 3203.6657 3207.2614 3211.7333
redmass: 5.5445 3.0389 1.1531 4.2072 4.1840 4.5460 5.9150 3.2834 3.6827 8.2465 7.1986 6.3096 3.1165 1.6561 3.6759 5.0203 1.3432 1.4586 7.1655 6.5089 1.3368 2.0358 1.4031 1.0882 1.3065 2.3640 2.2307 1.4885 3.3365 6.6535 1.0357 1.0858 1.3678 2.2381 2.8056 7.0050 6.4652 12.1893 1.0327 1.0912 1.1082 1.0892 1.0968 1.1077 1.0977
irintensity: 6.9769 3.4998 0.0443 6.4262 1.3967 27.1271 0.7339 3.5723 1.7260 4.5686 12.7803 15.1139 62.9425 19.9959 1.6425 10.3854 0.4623 0.0809 19.7990 21.8374 0.0174 21.8934 11.0504 2.5842 1.4661 129.5672 147.0681 50.9306 512.2149 19.0036 16.4114 37.8743 25.9772 36.5076 21.2054 33.2925 12.9855 311.8888 50.9382 39.1338 18.7303 7.0803 12.7188 11.0017 4.4075
temp: 298.150 k
press: 1.00000 atm
elementType: 6 6 7 6 6 6 1 1 1 1 6 8 8 6 1 1 1
symmnumber: 1
zpe: 345337.5 jmol-1
zpe.correction: 0.131532 hartree
zpe.thermalcorrener: 0.140206 hartree
zpe.thermalcorrenthalpy: 0.141150 hartree
zpe.thermalcorrgfe: 0.097098 hartree
zpe.sumelectzpe: -475.635876 hartree
zpe.sumelectthermal: -475.627202 hartree
zpe.sumelectthermalent: -475.626258 hartree
zpe.sumelectthermalfe: -475.670310 hartree
hfenergy: -475.767408 hartree
pointgroup: C01 [X(C7H7N1O2)]
dipole: 0.0185405 0.1180914 0.8218366 debye
dipolederiv: 0.2067611 -0.0846621 -0.2037349 -0.0501158 0.134913 0.0635916 0.0182693 -0.0467747 -0.1426018 -0.0173445 -0.0122654 0.095474 -0.0134247 -0.0771677 -0.0769463 0.0883192 -0.0734797 -0.2622866 -0.5622693 0.1410294 0.1612174 0.1169974 -0.4019235 -0.0955583 0.0069036 -0.0188336 -0.4280567 0.1327444 -0.1177456 -0.0311106 -0.1243088 -0.0232727 0.0604553 -0.0734151 0.0815227 0.1954266 0.47514 -0.1885376 0.2364865 -0.2247696 0.1161854 -0.1119255 0.0032968 0.0040191 0.0580598 -0.2564903 0.064993 -0.16053 0.1023404 -0.110008 0.1056111 0.0798836 -0.0138999 0.090484 0.0317312 0.0409792 -0.0536673 0.0359048 0.1169199 0.0244727 -0.086616 0.0408379 0.1167303 0.0211481 0.0663667 0.0787173 0.0650011 0.0895574 -0.0529044 0.0699323 -0.0485345 0.0413818 -0.0818665 0.0763169 -0.1107572 0.0821391 0.0720983 0.042541 -0.0734204 0.0239775 0.0257743 0.1094159 0.0071328 -0.0369892 0.0060742 0.1299711 -0.0150634 -0.0437041 -0.0117042 -0.0798337 1.4998544 -0.6388769 -0.4958714 -0.5623859 0.7352973 0.5419673 -0.0035603 0.2968432 2.2710584 -1.0039061 0.274749 -0.0967641 0.2394031 -0.550486 -0.0617805 -0.32403 0.0514238 -1.1289892 -0.9018893 0.3929204 0.6725061 0.3470082 -0.580185 -0.5475796 0.3767662 -0.4003605 -1.6927116 0.3132927 -0.0049692 -0.0367823 -0.024183 0.3488909 0.1422009 -0.1605104 0.2037985 1.1125032 -0.0199223 -0.1167147 -0.0719636 -0.0581172 0.0182128 -0.0475832 0.0660889 -0.026547 -0.0723689 0.0928162 0.0146553 -0.0315537 -0.010566 -0.0774028 0.0894969 0.0453367 -0.03855 -0.0894742 -0.0392158 0.0846289 0.085323 0.0730028 0.0583996 -0.0609954 0.0104598 -0.0237385 -0.0150956 unknown
polarizability: 103.880824|-24.4463731|66.9308582|5.7463504|12.0123225|148.6224969 unknown
InChI: InChI=1S/C7H7NO2/c1-10-7(9)6-4-2-3-5-8-6/h2-5H,1H3
charge 0 multiplicity 1
17 atoms
C  -0.37989976 1.89782352 2.94322371
C  -1.39045625 2.51570567 3.68722837
N  0.74538516 1.423283 3.48940134
C  -1.21899696 2.64400139 5.06198621
C  0.89827725 1.55170692 4.8045878
C  -0.05014314 2.15226683 5.63622392
H  -2.28521224 2.88196803 3.18164805
H  -1.98653483 3.12083578 5.6757226
H  1.82787572 1.15579414 5.22998102
H  0.12943908 2.2299228 6.71036459
C  -0.57789947 1.76701103 1.46629358
O  -1.56497018 2.16864463 0.88897161
O  0.44372975 1.16388975 0.85743895
C  0.31151646 1.01094596 -0.55142728
H  -0.56934622 0.40474884 -0.80235907
H  0.21769384 1.98618053 -1.04789251
H  1.21900845 0.50593438 -0.8952085
