program: Gaussian 16
title: E58
version: ES64L-G16RevC.01
frameworkgroup: C1[X(C10H20O2)]
method: RM06L
basis: def2SVP/W06
operation: Freq
keyword: #P
keyword: Geom=AllCheck
keyword: Guess=TCheck
keyword: SCRF=Check
keyword: GenChk
keyword: RM06L/def2SVP/W06
keyword: Freq
converged: YES YES YES YES
polarizability: 1.66150366e+02 -1.19282751e-01 1.38718472e+02 2.11767480e-04 -8.53863231e-04 1.23510813e+02
1716.lowfreq: -14.6614 -0.0013 -0.0003 0.0011 2.2106 4.6848 22.1444 39.7211 47.0008
frequency: 21.7229 39.6518 47.0008 51.7686 81.4411 112.7456 113.4712 126.3659 135.3152 197.6409 199.8342 226.6649 251.9178 253.4591 307.2341 335.9518 405.3019 465.4727 535.7012 575.4144 728.7917 729.6620 729.9376 762.7755 796.6956 848.0247 908.5641 918.2535 929.7685 967.2076 976.3118 1016.7191 1060.5349 1071.4365 1097.3922 1098.3361 1100.4037 1112.8651 1145.0659 1160.8682 1175.4667 1204.6652 1223.1409 1229.7916 1251.7029 1288.8039 1288.9158 1298.5922 1309.4616 1318.9692 1321.9923 1332.8443 1367.3918 1384.4214 1395.0773 1398.1243 1408.5952 1428.2697 1434.9024 1435.5054 1443.5830 1446.1444 1447.0555 1447.1588 1451.9203 1457.9152 1467.9847 1468.7661 1482.6145 1841.5756 3011.5374 3019.1836 3021.5524 3029.8655 3030.8805 3031.1047 3034.2673 3034.9965 3045.7859 3063.4758 3071.9063 3081.5844 3090.2846 3091.6272 3106.1196 3106.4683 3134.9122 3135.9066 3145.6601 3146.4604
redmass: 2.9562 1.8646 3.9766 2.6457 2.4161 3.6311 2.5026 1.9021 1.8190 2.6234 3.4844 4.4942 1.1199 1.1343 3.5475 4.2070 3.2056 3.0913 3.6013 2.0805 1.1165 1.0676 5.3810 1.1074 1.3447 1.1803 1.7913 1.6130 1.3487 4.8697 1.1657 4.9364 2.8067 2.3227 2.1286 1.7823 1.7341 1.5968 2.9058 2.9141 1.7623 2.2823 1.4425 1.3462 1.3247 1.1966 1.7146 1.1834 1.0892 1.0579 1.0693 1.3935 1.5157 1.3097 1.3539 1.2552 1.6446 1.6636 1.0763 1.1426 1.3769 1.3966 1.0346 1.0345 1.1084 1.1186 1.1222 1.1427 1.1619 12.2035 1.0627 1.0626 1.0625 1.0493 1.0423 1.0528 1.0624 1.0602 1.0648 1.1000 1.1007 1.1037 1.1048 1.1023 1.1034 1.1062 1.1036 1.1035 1.1034 1.1035
irintensity: 0.1032 0.1104 0.1493 0.8057 0.1544 0.9656 0.0024 0.0394 1.7707 6.0701 2.1412 3.0350 0.0087 0.4183 3.8466 8.3190 6.5603 6.7343 1.0004 2.9344 15.7559 9.5346 7.2180 0.0034 2.5870 0.4585 1.2363 6.3231 7.9656 14.1721 2.6664 52.7167 0.9084 1.6510 16.9410 1.4705 1.4869 0.7811 44.6593 11.5168 1.5851 439.8148 0.4839 3.4463 5.9110 1.2690 166.3906 0.0221 0.5880 0.4320 0.0961 0.0754 109.0769 0.2720 77.0088 16.9257 10.4962 8.2988 0.4785 0.6285 28.4192 6.6663 9.7046 9.8830 2.2664 0.5125 13.3132 6.8901 16.1709 333.2686 24.9775 53.8268 96.4558 37.2147 58.1381 5.5419 52.8677 109.4950 40.5225 3.5208 12.2060 49.3907 15.7711 31.7001 0.3522 144.6020 54.1155 54.5481 40.7204 40.7262
temp: 298.150 k
press: 1.00000 atm
elementType: 6 8 8 6 1 1 6 1 1 6 1 1 6 1 1 6 1 1 1 6 1 1 6 1 1 6 1 1 6 1 1 1
symmnumber: 1
zpe: 756809.2 jmol-1
zpe.correction: 0.288253 hartree
zpe.thermalcorrener: 0.303653 hartree
zpe.thermalcorrenthalpy: 0.304597 hartree
zpe.thermalcorrgfe: 0.243339 hartree
zpe.sumelectzpe: -542.843776 hartree
zpe.sumelectthermal: -542.828377 hartree
zpe.sumelectthermalent: -542.827433 hartree
zpe.sumelectthermalfe: -542.888691 hartree
hfenergy: -543.1320297 hartree
pointgroup: C01 [X(C10H20O2)]
dipole: 0.3412025 -0.7948026 -0.2504901 debye
polarizability: 126.6761977|-8.5450649|148.1786164|2.5677701|-13.6170462|153.5248361 unknown
InChI: InChI=1S/C10H20O2/c1-3-5-7-9-12-10(11)8-6-4-2/h3-9H2,1-2H3
charge 0 multiplicity 1
32 atoms
C  -0.8185106 0.47257701 6.31669929
O  -1.22664979 1.31053476 7.08785699
O  -0.37474612 -0.73276218 6.70746448
C  -0.40450031 -0.99545855 8.11696977
H  0.19572645 -0.23217274 8.63941828
H  -1.4386134 -0.88478312 8.48330946
C  -0.73517126 0.62057643 4.82615316
H  0.31005508 0.43044384 4.52884908
H  -1.30069061 -0.2123113 4.37500865
C  -1.2200144 1.95865656 4.31249326
H  -2.2614762 2.11974786 4.63940095
H  -0.64209048 2.76585551 4.79405288
C  -1.1275773 2.08837936 2.80249437
H  -0.08299456 1.9206895 2.48576061
H  -1.70482414 1.27353325 2.33089625
C  -1.61187226 3.42580294 2.28533206
H  -1.53598585 3.49746706 1.1910518
H  -2.66492451 3.60528992 2.55139004
H  -1.02835364 4.25831866 2.70764148
C  0.1269901 -2.38332666 8.35368898
H  -0.48196315 -3.10434531 7.78225883
H  1.14645934 -2.45427564 7.93791423
C  0.13656079 -2.75928629 9.82389969
H  -0.88609976 -2.67185402 10.23368582
H  0.7374791 -2.02367925 10.38886426
C  0.66899991 -4.1566772 10.09012508
H  0.06763809 -4.88795085 9.52192544
H  1.68955333 -4.24041977 9.67696045
C  0.6772953 -4.52868932 11.55717544
H  -0.33439504 -4.49334065 11.99000252
H  1.066412 -5.54323225 11.72371273
H  1.30224674 -3.83996493 12.14641657
