program: Gaussian 16
title: E57
version: ES64L-G16RevC.01
frameworkgroup: C1[X(C10H18O2)]
method: RM06L
basis: def2SVP/W06
operation: Freq
keyword: #P
keyword: Geom=AllCheck
keyword: Guess=TCheck
keyword: SCRF=Check
keyword: GenChk
keyword: RM06L/def2SVP/W06
keyword: Freq
converged: YES YES NO YES
polarizability: 1.80945503e+02 -6.18124671e+00 1.24456252e+02 -2.52879559e+00 4.56745048e+00 1.29598803e+02
1716.lowfreq: -0.0002 0.0008 0.0013 1.3867 4.2349 14.2874 23.7854 29.7120 53.1936
frequency: 23.7726 29.3777 53.0647 76.3053 79.7832 128.7321 131.7686 138.2426 158.8722 176.5896 198.7620 253.0418 259.9896 282.4409 345.3230 357.8635 418.3733 477.9322 545.2521 588.9269 705.0981 728.1910 752.3679 807.6101 842.6620 908.7358 921.8658 942.4985 958.3846 998.5682 1033.9927 1046.3564 1050.3987 1075.1661 1097.3245 1119.4071 1136.1663 1148.7559 1161.8829 1187.3146 1199.2214 1217.6679 1229.0172 1234.8987 1274.2958 1292.7603 1300.7406 1317.0116 1319.4319 1326.6509 1369.3748 1377.0669 1392.2451 1403.3783 1417.7790 1430.0493 1434.4273 1434.9998 1445.2376 1446.3984 1447.9014 1460.7609 1462.4110 1468.8023 1768.2711 1847.8923 3005.5613 3007.2907 3014.5329 3018.7311 3028.8370 3032.4188 3046.4839 3056.5864 3070.4414 3079.5446 3085.5408 3105.6039 3109.2624 3133.0779 3136.5965 3144.2885 3163.5692 3204.2844
redmass: 4.1274 5.5891 1.8053 3.0683 2.7372 2.1693 1.7854 1.2448 2.4576 2.5644 2.2815 1.1364 3.7965 3.6332 2.6631 3.8433 3.9063 2.4830 2.3142 3.1019 3.7760 1.0672 1.1489 1.7281 1.3480 1.9283 2.2846 2.6374 1.4410 1.0933 3.2777 3.2996 1.8933 2.1571 1.7917 1.9701 2.2148 1.7506 1.3127 1.6912 1.6211 1.9992 1.5131 1.3535 1.3086 1.2825 1.3372 1.1646 1.0500 1.4584 1.5487 1.2296 1.4289 1.6351 1.7246 1.1701 1.0404 1.0831 1.0834 1.0910 1.0357 1.1361 1.2911 1.1032 6.8079 11.8175 1.0627 1.0639 1.0629 1.0624 1.0403 1.0681 1.0329 1.0991 1.1012 1.1036 1.1034 1.0910 1.0965 1.1035 1.0901 1.1033 1.1083 1.1075
irintensity: 0.3925 1.8037 0.0232 0.3068 0.5102 0.7023 0.5395 0.8651 1.3244 3.3266 5.8300 0.0583 4.8740 6.8353 5.8357 17.4085 1.4143 0.2007 0.6791 8.4064 12.7234 10.1690 1.1901 9.6810 2.6921 9.9826 11.1569 3.9098 4.9251 43.3762 9.8563 11.3322 19.5076 2.3232 0.4069 21.7644 1.1954 9.0714 1.8158 94.5868 33.5758 229.5475 114.1399 12.6003 20.1021 15.3289 23.7798 0.9318 0.4793 36.8977 75.5690 48.3580 15.2984 23.1475 4.1861 2.6679 16.6419 0.3914 41.3490 7.4581 9.6942 1.7380 26.3349 12.9303 1.5469 319.3443 34.2083 17.8725 84.1979 144.0842 53.5364 21.4202 45.7598 2.7156 2.2146 36.8403 134.0894 57.6044 0.6629 55.4517 25.4763 43.0053 21.6035 11.4932
temp: 298.150 k
press: 1.00000 atm
elementType: 6 8 8 6 1 1 1 6 1 1 6 1 6 1 6 1 1 6 1 1 6 1 1 6 1 1 6 1 1 1
symmnumber: 1
zpe: 694483.1 jmol-1
zpe.correction: 0.264515 hartree
zpe.thermalcorrener: 0.279468 hartree
zpe.thermalcorrenthalpy: 0.280413 hartree
zpe.thermalcorrgfe: 0.220120 hartree
zpe.sumelectzpe: -541.630713 hartree
zpe.sumelectthermal: -541.615759 hartree
zpe.sumelectthermalent: -541.614815 hartree
zpe.sumelectthermalfe: -541.675107 hartree
hfenergy: -541.8952278 hartree
pointgroup: C01 [X(C10H18O2)]
dipole: 0.3228292 -0.5812881 -0.3748511 debye
polarizability: 140.3535567|-19.4719118|146.1586578|20.0350674|-15.5889546|148.4883436 unknown
InChI: InChI=1S/C10H18O2/c1-3-4-5-6-7-8-9-10(11)12-2/h7-8H,3-6,9H2,1-2H3
charge 0 multiplicity 1
30 atoms
C  -1.00750727 0.2000921 6.3603193
O  -1.54776741 0.86694923 7.21071095
O  -0.47668076 -1.0101103 6.59790197
C  -0.58396723 -1.48225575 7.93622526
H  -0.07256677 -0.80900223 8.63752692
H  -1.63500462 -1.57325196 8.24210932
H  -0.10783531 -2.46729594 7.95833081
C  -0.81583934 0.59084824 4.92013254
H  0.27646779 0.63711042 4.75652607
H  -1.15714979 -0.23896538 4.282021
C  -1.46924296 1.87793297 4.55489204
H  -1.24215203 2.73442815 5.20294173
C  -2.28425517 2.05227033 3.50834157
H  -2.51706748 1.18252882 2.87553275
C  -2.9369997 3.33551575 3.12191539
H  -2.5919855 3.63272986 2.1138526
H  -2.60892492 4.14164972 3.79992403
C  -4.45946119 3.25987177 3.10518717
H  -4.77778325 2.4376393 2.43893678
H  -4.82024521 2.9749576 4.10963392
C  -5.12665881 4.55193287 2.67107414
H  -4.80001388 5.37424183 3.33391216
H  -4.76317786 4.83264913 1.66529829
C  -6.64420086 4.48678743 2.65984297
H  -6.9673463 3.66327445 1.99860116
H  -7.00236201 4.2047086 3.6657167
C  -7.30195352 5.77949423 2.22635317
H  -8.39899281 5.70675082 2.2279356
H  -7.03080805 6.61453981 2.89077221
H  -6.99690102 6.06810169 1.20852366
