program: Gaussian 16
title: E55
version: ES64L-G16RevC.01
frameworkgroup: C1[X(C17H34O2)]
method: RM06L
basis: def2SVP/W06
operation: Freq
keyword: #P
keyword: Geom=AllCheck
keyword: Guess=TCheck
keyword: SCRF=Check
keyword: GenChk
keyword: RM06L/def2SVP/W06
keyword: Freq
converged: YES YES NO YES
polarizability: 2.69457999e+02 6.68029283e+00 2.41209073e+02 -2.86822814e-01 3.20782742e-01 2.11858345e+02
1716.lowfreq: -26.8516 -4.3642 -2.7253 -0.0022 0.0005 0.0013 10.1292 13.3423 14.8197
frequency: 9.5490 11.8120 14.0602 30.5753 40.1231 43.7141 58.5862 73.7881 85.9514 91.3974 103.3097 123.9734 124.2906 129.2598 139.8658 143.0020 154.3968 158.4754 172.9749 173.2623 204.0783 229.9365 242.6174 252.4099 275.9558 333.3706 359.8512 400.3447 439.8015 466.0180 504.5444 517.6855 541.6978 565.4093 612.0565 721.1090 721.5105 723.0569 724.4508 732.4016 748.7827 773.6319 807.2746 845.9615 874.3637 887.3438 910.0102 930.3163 973.3392 1013.9438 1021.9773 1025.5599 1045.0200 1047.8009 1052.4914 1068.9479 1082.1108 1086.3926 1093.7442 1097.4498 1097.8461 1098.8891 1099.1563 1108.4875 1119.1311 1128.5910 1149.9793 1154.7425 1168.4529 1191.0477 1196.2078 1209.1407 1213.3013 1229.7522 1233.3096 1250.5649 1257.0579 1273.2774 1278.3749 1295.7285 1297.8281 1308.6580 1313.7681 1315.8515 1317.1813 1318.3529 1320.6905 1321.3071 1321.9301 1324.1116 1348.6800 1370.5112 1385.2584 1388.6786 1397.4421 1409.7336 1419.8243 1426.8018 1430.8506 1430.9960 1431.3521 1431.6551 1432.8524 1435.2689 1435.7644 1438.9467 1443.5523 1447.0257 1448.5870 1449.1222 1453.4528 1454.8695 1459.8683 1463.8765 1466.0413 1467.1202 1468.8865 1470.0016 1857.6637 3002.9674 3003.0999 3003.6542 3004.0587 3004.8132 3005.4775 3005.7807 3007.0767 3008.3798 3009.6217 3010.5050 3017.8969 3028.1308 3032.9540 3033.7707 3039.6891 3048.7102 3050.0277 3052.1405 3054.9394 3058.2659 3061.9559 3066.3891 3070.4747 3073.8944 3076.5162 3078.3307 3079.8128 3086.8985 3102.4846 3132.0928 3143.4749 3148.0607 3183.9619
redmass: 3.1315 2.4143 4.4030 3.9805 1.6247 4.1682 3.4085 1.6130 3.8853 2.9203 1.6006 2.7724 4.5516 1.6849 3.5763 2.4654 2.1310 2.0380 2.0016 2.0151 3.6205 1.3391 4.0702 1.1255 3.5209 3.3195 3.6423 3.2021 3.2946 3.0846 3.0408 2.8747 2.0503 3.6601 6.1527 1.0655 1.0647 1.0600 1.0830 1.1153 1.1588 1.2094 1.2619 1.2999 4.7093 1.3114 1.6676 1.2905 1.2469 1.1786 4.6785 4.5275 3.4801 1.0835 3.3871 2.7674 2.4563 2.4748 2.4075 1.9681 1.6999 1.7120 2.0017 2.3311 1.4553 2.5759 1.7934 1.3233 3.1087 1.9471 1.4116 1.6714 1.5571 1.5253 1.5003 1.4339 1.3936 1.4063 1.3183 1.2669 1.4137 1.2070 1.0121 1.0245 1.1586 1.0422 1.0748 1.1373 1.1405 1.3541 1.5470 1.5716 1.4261 1.2234 1.6204 1.7882 1.8635 1.9328 1.4801 1.1062 1.2900 1.0850 1.1163 1.0991 1.7296 1.0926 1.0966 1.0351 1.0932 1.1050 1.0835 1.1214 1.1329 1.1349 1.2036 1.1525 1.1149 1.0995 12.2763 1.0623 1.0622 1.0627 1.0625 1.0632 1.0635 1.0631 1.0628 1.0627 1.0625 1.0623 1.0624 1.0404 1.0373 1.0613 1.0630 1.0973 1.0979 1.0988 1.1000 1.1015 1.1029 1.1041 1.1048 1.1050 1.1049 1.1046 1.1043 1.0998 1.1034 1.1035 1.1033 1.1083 1.1057
irintensity: 2.1279 1.3337 0.6087 0.7670 0.1955 1.4203 1.0691 0.0508 1.9658 1.2015 0.2735 0.7612 0.2374 0.2724 2.1109 0.7853 0.6435 0.4242 0.2672 0.0212 1.9884 1.6163 0.5878 0.0046 2.0863 0.1192 2.1575 0.1332 0.7431 1.0156 0.3717 0.6350 3.6474 8.5775 10.5797 4.2855 1.6114 22.2535 0.2131 4.4738 0.4299 4.3235 0.8723 4.5027 5.4617 0.7826 3.7908 2.8483 0.2338 1.1026 0.2471 0.7660 0.6893 0.0405 6.5826 2.2222 1.2065 12.1256 20.0036 6.2074 3.0703 1.5466 13.9384 14.0314 2.3059 52.3809 96.5285 6.5903 24.3135 0.0589 22.8804 1.6028 58.5542 87.3230 2.8703 39.3038 0.5871 48.0424 0.4594 1.4532 23.3346 0.0855 0.0245 0.0493 0.2408 0.2932 0.7570 2.8752 6.1582 24.7539 17.8717 26.2637 33.3216 16.1883 7.1594 18.4110 8.1792 12.1739 1.7584 0.0897 0.9634 0.1566 0.3891 0.2906 53.2252 0.4901 0.9248 9.7808 11.0018 2.4918 8.7664 1.4096 1.2297 0.2572 23.3592 6.7691 1.7684 23.2154 451.2405 0.9740 0.0230 3.2453 3.5119 0.5408 2.1253 16.9539 7.4698 9.5115 65.7841 662.0056 132.2404 51.1005 37.9700 8.0468 75.1224 0.2926 0.0829 1.2747 0.2678 2.7963 0.1689 3.6681 0.0326 11.3124 1.6217 266.9541 383.4153 9.4806 68.8986 56.7877 43.7648 26.5890 17.9640
temp: 298.150 k
press: 1.00000 atm
elementType: 8 6 8 6 1 1 6 1 1 1 6 1 1 6 1 1 6 1 1 6 1 1 6 1 1 6 1 1 6 1 1 6 1 1 6 1 1 6 1 1 6 1 1 6 1 1 6 1 1 6 1 1 1
symmnumber: 1
zpe: 1277018.6 jmol-1
zpe.correction: 0.486391 hartree
zpe.thermalcorrener: 0.511348 hartree
zpe.thermalcorrenthalpy: 0.512292 hartree
zpe.thermalcorrgfe: 0.425198 hartree
zpe.sumelectzpe: -817.595379 hartree
zpe.sumelectthermal: -817.570421 hartree
zpe.sumelectthermalent: -817.569477 hartree
zpe.sumelectthermalfe: -817.656571 hartree
hfenergy: -818.0817692 hartree
pointgroup: C01 [X(C17H34O2)]
dipole: -1.8836657 -0.6928987 -0.1400513 debye
polarizability: 240.0770488|1.0090331|232.4256153|-10.8157499|26.0478528|250.0227537 unknown
InChI: InChI=1S/C17H34O2/c1-3-4-5-6-7-8-9-10-11-12-13-14-15-16-17(18)19-2/h3-16H2,1-2H3
charge 0 multiplicity 1
53 atoms
O  2.81595394 -1.4871853 -1.90104062
C  2.83478724 -0.68630881 -0.81422855
O  3.87328224 -0.14506373 -0.52137764
C  1.55346883 -0.52998129 -0.04596115
H  1.21299159 -1.5311473 0.27238325
H  0.76639422 -0.18568028 -0.73943004
C  1.62781471 -2.14919939 -2.30389747
H  1.25506026 -2.83757079 -1.5317076
H  1.88290834 -2.73330482 -3.19462747
H  0.83013849 -1.44043702 -2.56956718
C  1.67176409 0.40289131 1.1402665
H  2.01863445 1.3898581 0.79101776
H  2.47022804 0.04065015 1.80905394
C  0.37526028 0.55397433 1.91382025
H  -0.42324679 0.89889716 1.23147325
H  0.04001575 -0.43738235 2.27015077
C  0.47817424 1.50700835 3.09068594
H  0.8110846 2.49730407 2.7296214
H  1.28077316 1.16560014 3.76969439
C  -0.81287092 1.66428832 3.87337128
H  -1.61855204 1.99001986 3.18985603
H  -1.1377898 0.6764679 4.24889454
C  -0.71381417 2.63824615 5.03360382
H  0.09504652 2.31638477 5.71504774
H  -0.39218707 3.62587338 4.65485068
C  -2.00229144 2.797024 5.82045389
H  -2.81388595 3.10601738 5.13614878
H  -2.31743594 1.81216322 6.21179132
C  -1.90638024 3.78820527 6.96632208
H  -1.09229898 3.48236322 7.64899966
H  -1.59423287 4.77305577 6.57259803
C  -3.1929293 3.94749445 7.75624547
H  -4.00894131 4.24412181 7.07173557
H  -3.50042576 2.96479729 8.15893326
C  -3.09939238 4.95078516 8.89172401
H  -2.28161145 4.65635239 9.57501822
H  -2.79416668 5.93354993 8.48748774
C  -4.38464268 5.10996745 9.68379876
H  -5.20348386 5.39898612 8.99942222
H  -4.68706286 4.12844928 10.09315064
C  -4.29261594 6.12020815 10.81323575
H  -3.47270305 5.83228064 11.49678191
H  -3.99147604 7.10175875 10.40298834
C  -5.5769458 6.27918505 11.60660116
H  -6.39770326 6.56543756 10.92312887
H  -5.87759272 5.29823334 12.01900006
C  -5.48545546 7.29240364 12.73472256
H  -4.66431025 7.00470002 13.41507032
H  -5.18449073 8.27087621 12.32002337
C  -6.77096285 7.44335831 13.51984808
H  -7.60249732 7.77096553 12.87673427
H  -7.07845483 6.49167974 13.98042479
H  -6.67784025 8.18062739 14.33016705
