program: Gaussian 16
title: E49
version: ES64L-G16RevC.01
frameworkgroup: C1[X(C10H10O4)]
method: RM06L
basis: def2SVP/W06
operation: Freq
keyword: #P
keyword: Geom=AllCheck
keyword: Guess=TCheck
keyword: SCRF=Check
keyword: GenChk
keyword: RM06L/def2SVP/W06
keyword: Freq
converged: YES YES NO YES
polarizability: 1.88427502e+02 5.95042674e+00 1.70516132e+02 1.47237438e+00 9.93165045e+00 8.44374963e+01
1716.lowfreq: -9.5271 -4.8347 -0.0010 -0.0008 0.0004 6.1170 29.1862 76.4114 85.7273
frequency: 28.3649 76.3945 85.7257 96.1511 120.3520 142.8753 152.6452 163.1979 218.4417 254.5728 288.8643 309.4803 336.7635 370.9661 402.4748 424.4440 544.8269 567.5938 662.7567 707.1877 720.8685 747.1308 803.0371 817.9373 843.5875 860.4524 906.6079 982.7670 1009.9495 1014.1417 1017.4156 1070.9125 1107.7957 1152.1546 1157.3248 1158.8523 1160.5997 1163.1499 1201.4255 1209.8168 1274.8115 1319.8927 1325.9520 1411.2138 1432.8009 1435.3345 1441.3969 1444.5376 1451.7793 1457.1956 1479.9427 1526.3551 1642.3897 1669.6119 1823.2737 1843.9786 3047.0047 3049.3655 3166.7534 3168.9288 3183.0337 3191.5306 3200.8895 3206.2664 3208.8334 3208.9974
redmass: 5.6770 4.8117 3.1702 3.7293 1.6016 2.6767 1.3915 1.8691 5.1422 5.5627 4.2745 4.9140 5.1761 6.4585 5.2500 3.8921 5.0826 4.3184 6.0932 5.9973 4.7370 2.0337 2.8441 3.8440 4.7943 4.8364 1.5531 1.4304 6.6290 4.6694 1.4426 2.0804 2.9618 1.7956 1.3531 1.2793 1.4214 1.4886 1.7945 2.0459 1.6018 3.8830 3.0452 9.5124 1.0368 1.0368 1.0813 1.0544 1.2706 1.2476 2.5954 3.2352 7.2939 6.7530 12.2620 12.3617 1.0325 1.0325 1.1081 1.1084 1.0862 1.0915 1.0967 1.1079 1.1005 1.1055
irintensity: 0.8248 1.8239 2.5848 5.6019 1.6052 3.0066 0.1390 0.8823 1.2485 1.5829 11.6763 10.4003 25.8727 15.8914 1.2395 1.6180 4.4682 9.0870 9.9853 14.0778 14.9515 93.7541 21.5031 13.2300 18.4946 3.3554 0.8900 3.9426 8.5795 21.2640 0.6195 24.3697 77.9575 77.1854 13.7588 25.6279 21.3546 75.6794 52.9490 149.2487 66.6286 494.1940 617.9484 6.8216 17.0950 16.7334 43.7546 24.8089 23.5201 27.1433 14.9907 46.4124 18.1537 16.0454 411.4831 317.4418 49.7914 51.4792 17.6430 16.3108 0.0934 6.9854 15.5514 10.2622 14.8755 5.2061
temp: 298.150 k
press: 1.00000 atm
elementType: 6 8 8 6 1 1 1 6 6 6 6 6 6 1 1 1 1 6 8 8 6 1 1 1
symmnumber: 1
zpe: 488507.5 jmol-1
zpe.correction: 0.186063 hartree
zpe.thermalcorrener: 0.199401 hartree
zpe.thermalcorrenthalpy: 0.200346 hartree
zpe.thermalcorrgfe: 0.145063 hartree
zpe.sumelectzpe: -687.245489 hartree
zpe.sumelectthermal: -687.232150 hartree
zpe.sumelectthermalent: -687.231206 hartree
zpe.sumelectthermalfe: -687.286489 hartree
hfenergy: -687.4315516 hartree
pointgroup: C01 [X(C10H10O4)]
dipole: 0.860676 -0.9153485 -0.9344179 debye
dipolederiv: 1.054836 -0.6893509 0.476495 -0.7032515 1.3547462 -0.3810336 -0.0155123 0.0276338 2.2032791 -0.688492 0.3508976 -0.0305347 0.3460181 -0.8786415 -0.108427 0.2253403 -0.3065932 -1.122324 -0.6817699 0.4056609 -0.5177774 0.3594611 -0.8320024 0.5646819 -0.2500957 0.3693793 -1.6771155 0.304737 -0.0100178 0.0400254 -0.0018809 0.3284979 -0.1121751 0.104394 -0.1966753 1.1100254 0.0765768 -0.0370272 -0.0057995 -0.0668465 -0.0567177 -0.1047543 -0.0345996 0.0354017 -0.075971 -0.0657364 -0.0748271 0.0864251 -0.0267391 0.0663925 0.0356244 -0.0547887 0.0457066 -0.0598619 0.0152941 0.0947883 -0.0528658 0.0905974 0.0005204 0.0859114 0.0009738 0.0156413 -0.0123761 -0.0915661 -0.042242 0.0892552 0.0682405 0.1298016 -0.0601934 0.0469949 0.0333485 -0.3775359 -0.1107588 0.0000898 0.0655719 0.0177762 0.0248088 0.0456586 0.0316596 0.1708245 -0.1275745 -0.0818739 -0.1070114 -0.0441998 -0.1332424 -0.4996878 0.3040812 0.060665 0.211399 -0.0419364 -0.094412 0.0457307 -0.0235477 0.0380891 0.067051 -0.0147232 -0.0377276 -0.0934194 0.0593582 -0.0596178 0.0953435 -0.0174343 0.0148096 0.0552203 0.1212714 -0.0127734 -0.0701083 -0.0846777 -0.116772 0.0024041 -0.0530564 -0.0019101 -0.1409306 -0.0705146 -0.0307521 0.0068671 0.1281416 0.1354766 -0.0108044 -0.0286321 -0.0302898 -0.0121633 -0.0515941 -0.0123835 -0.1056377 0.0465178 0.1247127 -0.0491333 0.0291943 -0.0484764 -0.0413088 0.0829574 0.0230493 0.0778933 0.0477895 0.1193228 -0.0485201 0.0111878 -0.0206822 0.0097037 -0.0958702 -0.0096671 -0.0627693 0.0731259 0.1331262 -0.015325 0.0256007 -0.0123549 0.0954113 -0.0009259 0.0336705 0.0109812 -0.1034464 0.7898036 -0.1223462 -0.5937088 0.2666953 2.580085 -0.20431 -0.5378317 0.3110739 1.3358876 -0.6830827 0.0055902 0.4004609 -0.1747775 -0.9824254 0.1345097 0.3692756 -0.0504039 -1.0896737 -0.4469824 0.074771 0.1907478 -0.1436642 -2.1767208 -0.0262484 0.1542223 -0.275761 -0.606439 0.3499342 0.2295986 -0.0274495 0.1592486 1.0831593 -0.1192857 -0.0455299 -0.2563714 0.3330902 0.0436653 -0.0404976 -0.0659825 -0.0426367 -0.0399794 -0.0283004 -0.0520896 0.1200698 -0.0576156 -0.0948911 -0.0991553 -0.0112252 0.048031 -0.054496 0.0247794 -0.007133 0.0735626 0.0771658 0.0684696 0.0413836 0.0572494 -0.0022147 -0.0803243 -0.0211194 0.050639 -0.0920433 0.0221665 unknown
polarizability: 87.0057888|15.1515949|176.3630026|-12.280249|-8.475938|180.0123387 unknown
InChI: InChI=1S/C10H10O4/c1-13-9(11)7-5-3-4-6-8(7)10(12)14-2/h3-6H,1-2H3
charge 0 multiplicity 1
24 atoms
C  2.7844465 0.75308849 -10.96868324
O  2.12243596 1.55306407 -10.35096528
O  3.5751984 -0.16745522 -10.40361691
C  3.46089444 -0.29317114 -8.99099159
H  3.70256003 0.6511294 -8.48544926
H  2.44186314 -0.59448518 -8.71168541
H  4.17162469 -1.06784387 -8.68817205
C  2.89359764 0.71771425 -12.45612814
C  3.21153454 1.90407737 -13.12023738
C  2.70967759 -0.46665277 -13.19632742
C  3.38425167 1.91651554 -14.50298446
C  2.89256824 -0.44414265 -14.58362171
C  3.23221581 0.73952526 -15.23425579
H  3.34260138 2.81920494 -12.53815843
H  3.64105973 2.84951281 -15.00947689
H  2.73943469 -1.36125219 -15.15500983
H  3.36596655 0.74447386 -16.31813449
C  2.19487516 -1.68758407 -12.52131663
O  1.49946677 -1.67769723 -11.52956618
O  2.55076062 -2.80635841 -13.16490322
C  2.04248559 -4.02097077 -12.62108851
H  2.39234603 -4.16635487 -11.59052045
H  0.94440739 -4.02550446 -12.62413872
H  2.41924533 -4.82690056 -13.25744325
