program: Gaussian 16
title: E12
version: ES64L-G16RevC.01
frameworkgroup: C1[X(C4H8O3)]
method: RM06L
basis: def2SVP/W06
operation: Freq
keyword: #P
keyword: Geom=AllCheck
keyword: Guess=TCheck
keyword: SCRF=Check
keyword: GenChk
keyword: RM06L/def2SVP/W06Freq
converged: YES YES NO NO
polarizability: 7.23474020e+01 -1.97341057e-01 6.18269607e+01 7.54818190e-01 2.23371397e+00 5.01670592e+01
1716.lowfreq: -15.1719 -0.0009 0.0011 0.0015 10.5614 19.1284 68.6549 118.3755 134.0170
frequency: 68.0400 118.3139 134.0072 204.0552 243.5862 346.4714 400.5658 467.7749 553.8189 576.4494 630.1650 701.5715 824.2805 937.9606 978.5972 1013.0753 1042.4823 1053.8751 1110.6836 1196.6239 1288.0108 1300.2446 1362.3336 1375.8886 1411.1947 1412.1994 1419.3759 1432.0713 1444.2728 1492.6963 1818.1399 3012.9990 3062.1555 3065.7413 3177.3651 3183.2390 3194.5135 3215.4970 3746.5742
redmass: 1.1438 3.9533 3.3530 3.0181 1.1434 3.5971 3.2837 3.0385 2.0033 1.4636 2.5697 3.8059 2.9647 2.0329 5.9788 1.6287 1.9133 1.8210 1.8095 2.3976 1.9857 1.3539 1.2264 1.3346 1.4287 1.1065 1.0539 1.0483 1.1543 1.9164 10.6922 1.0864 1.0391 1.0394 1.1021 1.1049 1.1052 1.1073 1.0651
irintensity: 3.7036 4.1302 1.1582 4.9863 2.2554 11.4001 6.8398 26.0879 23.9811 127.4953 37.1135 26.6536 116.8395 70.0496 83.4049 60.3449 16.6491 120.9311 44.4987 150.0411 323.8251 176.3227 96.2441 79.4651 65.3588 35.6452 21.9288 17.1621 17.3359 62.5300 365.3128 62.5289 14.4615 1.8527 0.5217 14.0966 9.5537 5.0709 136.9341
temp: 298.150 k
press: 1.00000 atm
elementType: 8 6 8 6 1 1 1 6 1 6 1 1 1 8 1
symmnumber: 1
zpe: 323092.9 jmol-1
zpe.correction: 0.123060 hartree
zpe.thermalcorrener: 0.131027 hartree
zpe.thermalcorrenthalpy: 0.131971 hartree
zpe.thermalcorrgfe: 0.090623 hartree
zpe.sumelectzpe: -382.492274 hartree
zpe.sumelectthermal: -382.484307 hartree
zpe.sumelectthermalent: -382.483363 hartree
zpe.sumelectthermalfe: -382.524711 hartree
hfenergy: -382.6153339 hartree
pointgroup: C01 [X(C4H8O3)]
dipole: -0.8669698 -0.0621173 -0.1333688 debye
dipolederiv: -0.8161114 -0.0775105 0.1521432 -0.1023095 -1.8990656 0.6710872 0.2252554 0.7146848 -0.8019438 1.4673751 -0.419414 -0.3292434 -0.097592 2.013823 -0.69439 -0.4999913 -0.474818 0.7707702 -1.1819646 0.3276411 0.1930576 0.0916632 -0.9110037 0.1741096 0.3069764 0.0255553 -0.550086 -0.2959969 -0.1700498 0.1761952 -0.1235681 -0.1084137 0.0774967 0.1607856 0.0989847 -0.1681046 0.0175344 -0.0389851 -0.0449058 -0.026052 0.0948312 0.0560664 -0.0854157 0.0143513 0.0543772 0.1239861 -0.0108761 0.0322064 -0.0022194 0.0264519 -0.0723285 0.0678807 -0.0202657 0.0172317 0.0504404 0.0670125 -0.0033932 0.0084059 -0.0521876 0.0732284 0.0250934 0.0481883 0.0796626 1.309852 0.4587761 -0.0054613 0.185039 1.3164049 -0.3148701 0.1166205 -0.4205942 1.0734524 -0.0358355 -0.0270564 0.0451352 -0.0007449 -0.1268184 -0.1355988 -0.0080243 0.0021926 -0.1399061 -0.0285539 0.0437974 -0.0263321 0.082418 -0.131802 0.0887082 -0.0004427 0.0444164 0.0063917 -0.0544501 0.0184674 -0.0900177 -0.0515375 0.0541743 -0.0282482 -0.0718267 -0.0060816 0.0698444 0.0867129 0.0350307 -0.006086 0.037568 0.0121725 -0.0333737 0.031935 -0.1149319 -0.0621007 0.0235159 -0.0673661 0.0887859 -0.0159232 -0.0094204 0.0731411 0.0585241 0.0833927 0.032202 -1.1134106 -0.1847409 -0.132574 -0.0760279 -0.6476126 0.1409783 -0.2955149 0.0334441 -0.7237395 0.4469062 0.0452737 -0.0495101 0.0908804 0.3684661 -0.0760065 -0.0318556 -0.0285188 0.3419485 unknown
polarizability: 61.4984039|0.3807819|68.238218|-4.251739|-8.0004062|54.6048 unknown
InChI: InChI=1S/C4H8O3/c1-3(5)7-4(2)6/h3,5H,1-2H3
charge 0 multiplicity 1
15 atoms
O  3.19737463 5.86744916 -12.55888198
C  3.61778951 4.63769929 -12.23872086
O  4.70540416 4.20516478 -12.56700969
C  2.59757789 3.89190357 -11.44924795
H  1.68142321 3.76579744 -12.04157112
H  2.31705895 4.46303462 -10.55469701
H  2.98002623 2.91011482 -11.15526354
C  4.119092 6.64771226 -13.38907924
H  4.27384783 6.04095058 -14.30183157
C  3.42996164 7.94138299 -13.68612817
H  2.46153913 7.76625898 -14.1688508
H  3.26591708 8.50391592 -12.75748331
H  4.05005151 8.54929002 -14.35585872
O  5.30123086 6.88010897 -12.72872966
H  5.74509818 6.01910328 -12.67359587
