program: Orca
programVersion: 4.2.1
elementType: Ru Cl O N N N N H C H H H C H H C H H C C H C H C H C C H H C C C C C C H C C H C C H C H C H C C H C H C H H H C H H H C H H H C H H H C H H H
elementType: Ru
charge: 0
multiplicity: 1
keywords: RKS wB97M-V def2-TZVPP def2-TZVPP/C def2/J RIJCOSX TightSCF GRID6 CPCM NBO
formula: C29H35ClN4ORu
InChI: InChI=1S/C28H34N4.CO.ClH.Ru.H/c1-20(2)24-13-10-14-25(21(3)4)28(24)32-19-31(26-15-7-8-16-27(26)32)18-23-12-9-11-22(29-23)17-30(5)6;1-2;;;/h7-16,20-21H,17-18H2,1-6H3;;1H;;/q-1;;;+2;/p-1
71 atoms
Ru -1.193261 -0.697311 -0.225971
Cl -1.701071 -0.317155 -2.73461
O  0.467968 -3.165286 -0.462308
N  -3.172273 -1.858838 0.116935
N  -2.672277 0.845386 0.21577
N  -0.05311 2.003096 -0.347644
N  1.559177 0.61464 0.146473
H  -3.531805 -2.488954 -1.858743
C  -4.03338 -1.922182 -1.066274
H  -4.224808 -0.913905 -1.45336
H  -4.996009 -2.409025 -0.824873
H  -3.875955 -3.705232 0.917841
C  -2.93256 -3.212797 0.619261
H  -2.259841 -3.181088 1.485932
H  -2.462862 -3.817639 -0.165873
C  -3.820488 -1.046793 1.162045
H  -3.261747 -1.20265 2.100446
H  -4.857845 -1.383106 1.343804
C  -3.789559 0.411249 0.83193
C  -4.820421 1.288042 1.16188
H  -5.721057 0.906694 1.645733
C  -4.673815 2.640534 0.868621
H  -5.462922 3.350344 1.124692
C  -3.511724 3.07679 0.239501
H  -3.364767 4.128838 -0.011108
C  -2.526358 2.145484 -0.086105
C  -1.304963 2.525232 -0.866674
H  -1.438714 2.138291 -1.891862
H  -1.222079 3.615275 -0.924072
C  1.071013 2.782601 -0.116528
C  2.107197 1.888867 0.197144
C  0.223316 0.660065 -0.184893
C  2.3425 -0.570008 0.317995
C  2.421628 -1.164542 1.591159
C  3.2340 -2.295194 1.72941
H  3.31818 -2.777679 2.706995
C  3.934749 -2.812873 0.644098
C  3.83351 -2.209818 -0.605139
H  4.377399 -2.630705 -1.455659
C  3.037412 -1.075382 -0.797159
C  1.680502 -0.608498 2.789145
H  0.929142 0.10474 2.415195
C  2.924662 -0.463168 -2.179289
H  2.327214 0.45923 -2.102311
C  -0.112905 -2.150745 -0.398795
H  -1.025155 -0.865613 1.368452
C  1.296035 4.156844 -0.161314
C  2.58968 4.603199 0.121092
H  2.798219 5.675031 0.09578
C  3.622059 3.708208 0.431988
H  4.6215 4.093658 0.644979
C  3.398293 2.329859 0.47244
H  4.197545 1.623937 0.709658
H  0.500094 4.86188 -0.408575
H  4.562813 -3.698064 0.772959
C  2.628774 0.155914 3.707918
H  3.409747 -0.505183 4.116008
H  3.135468 0.979023 3.182828
H  2.087214 0.59141 4.560934
C  0.93416 -1.695588 3.551759
H  0.285175 -1.253729 4.322419
H  0.297881 -2.297303 2.88522
H  1.620103 -2.384809 4.067676
C  2.184446 -1.400359 -3.128054
H  1.16732 -1.620531 -2.77458
H  2.092065 -0.949045 -4.127269
H  2.715976 -2.357878 -3.246189
C  4.289596 -0.077429 -2.737171
H  4.184592 0.42458 -3.710132
H  4.83039 0.608096 -2.06802
H  4.930709 -0.958357 -2.896045
elementType: Ru Cl O N H C
totalener: -1975.60445189 hartree
nucrepener: 4750.41001455 hartree
electener: -6726.01446644 hartree
twoeener: 5462.67110116 hartree
cpcmener: -0.03700134 hartree
kineticenergy: 1908.98195419 hartree
exchangeener: -164.704251347392 hartree
correlationener: -9.051881036732 hartree
xcener: -172.766645203613 hartree
chargesum: 0.0000000
charge: -0.161144 -0.537258 -0.225888 -0.179270 -0.140190 -0.064996 0.115356 0.141905 -0.229069 0.144567 0.128138 0.130257 -0.282092 0.148088 0.138890 -0.132377 0.174348 0.136025 0.169587 -0.154781 0.150723 -0.106464 0.164275 -0.136647 0.148164 0.156362 -0.175579 0.174618 0.129414 0.053500 0.092567 0.213917 -0.115971 0.049825 -0.038243 0.144761 -0.231698 -0.042568 0.144203 -0.024192 -0.126068 0.078120 -0.098966 0.066743 0.049720 -0.161080 -0.094835 -0.173895 0.153224 -0.148425 0.153605 -0.250152 0.158240 0.148780 0.151371 -0.336194 0.114062 0.112785 0.115547 -0.360290 0.118717 0.121306 0.116672 -0.334906 0.124730 0.111504 0.111283 -0.336676 0.118517 0.113572 0.111920
charge: -0.291024 -0.306801 0.179300 0.222235 0.263902 0.303492 0.313794 0.020599 -0.035948 0.018051 0.011309 0.014260 -0.025782 0.024205 0.025926 -0.052026 0.048851 0.038712 -0.122688 0.006131 0.039154 0.028475 0.041389 0.006110 0.038689 -0.121530 -0.014562 0.032461 0.044958 -0.120339 -0.126334 -0.199766 -0.090354 -0.036523 -0.005194 0.030564 -0.016322 -0.005346 0.030434 -0.038147 -0.097189 0.035951 -0.092755 0.037219 -0.287932 -0.075045 -0.013334 -0.029470 0.028527 -0.029922 0.028703 -0.009318 0.032959 0.028672 0.029708 0.009397 0.017971 0.015848 0.017786 0.004034 0.017787 0.018514 0.014616 0.012279 0.020216 0.016524 0.016025 0.007586 0.018288 0.015577 0.016465
qa: -0.1611 -0.5373 -0.2259 -0.1793 -0.1402 -0.0650 0.1154 0.1419 -0.2291 0.1446 0.1281 0.1303 -0.2821 0.1481 0.1389 -0.1324 0.1743 0.1360 0.1696 -0.1548 0.1507 -0.1065 0.1643 -0.1366 0.1482 0.1564 -0.1756 0.1746 0.1294 0.0535 0.0926 0.2139 -0.1160 0.0498 -0.0382 0.1448 -0.2317 -0.0426 0.1442 -0.0242 -0.1261 0.0781 -0.0990 0.0667 0.0497 -0.1611 -0.0948 -0.1739 0.1532 -0.1484 0.1536 -0.2502 0.1582 0.1488 0.1514 -0.3362 0.1141 0.1128 0.1155 -0.3603 0.1187 0.1213 0.1167 -0.3349 0.1247 0.1115 0.1113 -0.3367 0.1185 0.1136 0.1119
va: 5.3986 0.8365 2.2946 3.1464 3.1772 3.2816 2.9378 0.9844 3.7717 0.9785 0.9930 0.9900 3.8206 0.9780 0.9774 3.6877 0.9711 0.9980 3.7200 3.9457 0.9941 3.9382 0.9845 3.9165 0.9921 3.8187 3.7259 1.0213 0.9987 3.9333 3.6629 3.4143 3.5107 3.6210 3.7782 0.9892 4.0279 3.8003 0.9884 3.7094 3.8558 1.0152 3.8753 1.0091 3.5738 0.9998 3.8460 3.9219 0.9875 3.8886 0.9872 3.8692 0.9988 0.9957 0.9884 3.8362 0.9910 0.9900 0.9909 3.8184 0.9890 0.9918 0.9902 3.8378 0.9861 0.9929 0.9925 3.8210 0.9893 0.9923 0.9905
energy: -1975.604451890021
dipole: 88.43855 -90.41803 -1.97949 38.38432 -36.04972 2.33460 27.30554 -24.18178 3.12376
magnitude: 4.37340 au
magnitude: 11.11629 debye
