program: Orca
programVersion: 4.2.1
elementType: Ru Cl Cl P N H C C H C H C H C H C C C H C H C H C H C H N H C C C C C C H H H H H H H H H H C H H C C C C C C H H H H H C S O C H H H H H H H
elementType: Ru
charge: 0
multiplicity: 1
keywords: RKS wB97M-V def2-TZVPP def2-TZVPP/C def2/J RIJCOSX TightSCF GRID6 CPCM NBO
formula: C27H35Cl2N2OPRuS
InChI: InChI=1S/C25H29N2P.C2H6OS.2ClH.Ru/c26-23-16-8-9-17-24(23)27-19-20-11-7-10-18-25(20)28(21-12-3-1-4-13-21)22-14-5-2-6-15-22;1-4(2)3;;;/h1-7,10-15,18,23-24,27H,8-9,16-17,19,26H2;1-2H3;2*1H;/q;+1;;;+1/p-2
70 atoms
Ru 0.660114 -0.769127 0.025618
Cl 0.846754 -0.878066 -2.436386
Cl 1.021911 -0.651208 2.467475
P  -1.251112 0.480835 -0.021456
N  1.907954 1.012839 -0.194177
H  1.942698 1.141523 -1.212171
C  -0.938789 2.119051 -0.803586
C  -1.873722 2.733749 -1.646376
H  -2.816306 2.228905 -1.870831
C  -1.637221 3.995608 -2.190351
H  -2.384453 4.453658 -2.842771
C  -0.455218 4.667052 -1.890243
H  -0.257855 5.655848 -2.31085
C  0.477946 4.070155 -1.044872
H  1.406274 4.596188 -0.803133
C  0.255688 2.805036 -0.488614
C  -2.64287 -0.226244 -0.988697
C  -2.544098 -0.301321 -2.388314
H  -1.679076 0.13219 -2.895137
C  -3.532041 -0.940719 -3.134295
H  -3.442969 -0.983776 -4.222847
C  -4.625821 -1.528236 -2.495846
H  -5.398335 -2.033032 -3.081412
C  -4.726541 -1.466901 -1.106784
H  -5.577925 -1.924655 -0.596868
C  -3.743751 -0.819479 -0.357507
H  -3.83553 -0.787608 0.73033
N  2.672471 -1.653678 0.067529
H  2.801967 -2.487408 -0.507031
C  3.676498 -0.647971 -0.317396
C  5.089254 -1.041343 0.08803
C  6.103438 0.01887 -0.307085
C  5.716642 1.376176 0.256552
C  4.305726 1.767306 -0.155999
C  3.28624 0.710759 0.256466
H  3.620082 -0.564088 -1.418872
H  5.339159 -2.01697 -0.358263
H  5.108761 -1.187559 1.183704
H  7.110021 -0.272026 0.029399
H  6.155504 0.080776 -1.408466
H  6.43001 2.149968 -0.06489
H  5.776384 1.346129 1.358851
H  4.044134 2.745385 0.273349
H  4.257612 1.88724 -1.254384
H  3.244697 0.630974 1.358273
C  1.307835 2.218583 0.411484
H  2.074218 2.98608 0.597831
H  0.903838 1.924874 1.395049
C  -2.040706 0.988794 1.566615
C  -2.476132 2.301156 1.802206
C  -2.19841 0.029763 2.579471
C  -3.062557 2.645949 3.020846
C  -2.795634 0.376619 3.790138
C  -3.225333 1.684695 4.01713
H  -2.36249 3.070751 1.03442
H  -1.860029 -0.993629 2.398996
H  -3.394443 3.673864 3.188063
H  -2.918458 -0.382411 4.567244
H  -3.685169 1.955333 4.971167
C  -0.952274 -3.469368 -1.279867
S  -0.472005 -2.686201 0.267891
O  -1.696844 -2.760444 1.140054
C  0.628372 -3.971995 0.893001
H  -1.678628 -2.807036 -1.766108
H  -0.079427 -3.591895 -1.931608
H  -1.418537 -4.433306 -1.03846
H  1.447858 -4.162598 0.188839
H  1.019453 -3.610094 1.852053
H  0.038258 -4.884703 1.045749
H  2.827777 -1.936019 1.040145
elementType: Ru Cl P N H C S O
totalener: -2989.65232947 hartree
nucrepener: 5477.22911101 hartree
electener: -8466.88144048 hartree
twoeener: 6584.90806289 hartree
cpcmener: -0.03867060 hartree
kineticenergy: 2921.45950564 hartree
exchangeener: -205.444414560640 hartree
correlationener: -10.275344787512 hartree
xcener: -214.643196223726 hartree
chargesum: -0.0000000
charge: -0.493717 -0.446401 -0.433945 0.668609 -0.102975 0.172053 -0.214141 -0.092338 0.166354 -0.164716 0.155207 -0.145194 0.156359 -0.128753 0.141685 0.003969 -0.040887 -0.244771 0.140229 -0.156084 0.152394 -0.140478 0.154165 -0.187287 0.153130 -0.108192 0.152508 -0.157353 0.181835 -0.053320 -0.219730 -0.198111 -0.205706 -0.206860 -0.039333 0.161561 0.111384 0.116398 0.107880 0.104637 0.107754 0.105658 0.111518 0.118690 0.169819 -0.174649 0.130179 0.181075 -0.051875 -0.126408 -0.153362 -0.194511 -0.195634 -0.132378 0.159717 0.176924 0.151920 0.149529 0.153797 -0.324421 0.643426 -0.580203 -0.377453 0.148171 0.157779 0.160751 0.149354 0.165610 0.160677 0.188487
charge: -0.879003 -0.185356 -0.176737 0.866650 0.313417 -0.019039 -0.178222 -0.022202 0.032595 -0.017693 0.030911 -0.010148 0.031585 -0.002902 0.032748 -0.087216 -0.209911 -0.037160 0.019931 -0.028768 0.028698 -0.018674 0.028818 -0.023680 0.028738 -0.021806 0.030498 0.353969 -0.010123 -0.122163 -0.023779 -0.030385 -0.028952 -0.019941 -0.115567 0.039484 0.027746 0.031472 0.023962 0.027263 0.024386 0.027807 0.023430 0.032247 0.038299 -0.043537 0.029139 0.030074 -0.199488 -0.027494 -0.031072 -0.028554 -0.027743 -0.017899 0.029051 0.013282 0.027605 0.027813 0.028663 -0.121448 0.941403 -0.377606 -0.120066 0.013514 0.008030 0.009154 0.011250 0.008796 0.010950 -0.019043
qa: -0.4937 -0.4464 -0.4339 0.6686 -0.1030 0.1721 -0.2141 -0.0923 0.1664 -0.1647 0.1552 -0.1452 0.1564 -0.1288 0.1417 0.0040 -0.0409 -0.2448 0.1402 -0.1561 0.1524 -0.1405 0.1542 -0.1873 0.1531 -0.1082 0.1525 -0.1574 0.1818 -0.0533 -0.2197 -0.1981 -0.2057 -0.2069 -0.0393 0.1616 0.1114 0.1164 0.1079 0.1046 0.1078 0.1057 0.1115 0.1187 0.1698 -0.1746 0.1302 0.1811 -0.0519 -0.1264 -0.1534 -0.1945 -0.1956 -0.1324 0.1597 0.1769 0.1519 0.1495 0.1538 -0.3244 0.6434 -0.5802 -0.3775 0.1482 0.1578 0.1608 0.1494 0.1656 0.1607 0.1885
va: 5.0394 0.9637 0.9763 3.8978 3.0769 1.0023 3.8402 3.7493 0.9864 3.9229 0.9873 3.9174 0.9866 3.9111 0.9959 3.5782 3.4930 3.8559 1.0379 3.9203 0.9876 3.8920 0.9855 3.9557 0.9875 3.8420 1.0005 3.2280 0.9838 3.8264 3.8630 3.7840 3.8076 3.8219 3.7460 1.0044 0.9980 0.9933 0.9951 0.9936 0.9945 0.9925 1.0049 0.9945 1.0090 3.6551 1.0000 1.0094 3.6629 3.8359 3.6962 3.9512 3.9788 3.8752 0.9858 1.0325 0.9887 0.9893 0.9853 3.8346 4.4955 1.7942 3.8328 0.9854 0.9968 0.9983 0.9852 0.9957 0.9974 0.9932
energy: -2989.652329470102
dipole: -23.75481 26.08655 2.33174 52.53544 -52.21249 0.32295 -3.75578 2.53222 -1.22356
magnitude: 2.65300 au
magnitude: 6.74339 debye
