program: Orca
programVersion: 4.2.1
elementType: Ru Cl Cl P N H H C C H C H C H C H C H C C H C H C H C H C H P C H C H N H S C C H C H C H C H C H C C H C H C H C H C H C H C H H C H H H C C C C C C H H H H H C C C C C C H H H H H O O C C C C C C H H H H C H H H
elementType: Ru
charge: 0
multiplicity: 1
keywords: RKS wB97M-V def2-TZVPP def2-TZVPP/C def2/J RIJCOSX TightSCF GRID6 CPCM NBO
formula: C48H48Cl2N2O2P2RuS
InChI: InChI=1S/C27H26P2.C21H22N2O2S.2ClH.Ru/c1-5-14-24(15-6-1)28(25-16-7-2-8-17-25)22-13-23-29(26-18-9-3-10-19-26)27-20-11-4-12-21-27;1-16-12-14-19(15-13-16)26(24,25)23-21(18-10-6-3-7-11-18)20(22)17-8-4-2-5-9-17;;;/h1-12,14-21H,13,22-23H2;2-15,20-21,23H,22H2,1H3;2*1H;/q;;;;+2/p-2
106 atoms
Ru 0.826234 0.209785 -0.397522
Cl 0.412446 -0.007388 2.034644
Cl 0.550528 0.725844 -2.81336
P  2.80435 1.295237 -0.188116
N  -0.353859 2.040671 -0.11637
H  -0.345282 2.239504 0.88767
H  0.079575 2.839482 -0.581326
C  2.579556 3.057721 -0.648496
C  2.753712 3.49845 -1.966985
H  3.133823 2.814591 -2.730009
C  2.436548 4.809715 -2.323411
H  2.581103 5.138217 -3.355599
C  1.934602 5.696544 -1.371046
H  1.683355 6.721623 -1.653747
C  1.754235 5.267892 -0.054817
H  1.361645 5.955672 0.698419
C  2.073579 3.959285 0.302893
H  1.921251 3.62876 1.336326
C  3.724784 1.443982 1.408105
C  4.625039 2.503362 1.607625
H  4.709232 3.302357 0.865257
C  5.428654 2.549581 2.745909
H  6.121676 3.383387 2.884609
C  5.351423 1.534412 3.700096
H  5.98005 1.571476 4.593452
C  4.470713 0.471915 3.504197
H  4.403909 -0.330547 4.243777
C  3.663802 0.425103 2.366509
H  2.970202 -0.403719 2.224754
P  2.035261 -1.656977 -0.953097
C  -1.730043 1.909889 -0.599063
H  -1.67812 1.865342 -1.699709
C  -2.294756 0.564012 -0.110808
H  -2.220582 0.559603 0.990446
N  -1.386954 -0.510634 -0.599525
H  -1.458302 -0.564488 -1.624895
S  -1.828479 -2.180839 -0.097415
C  1.196323 -3.12209 -1.705965
C  0.424609 -2.903178 -2.856097
H  0.305646 -1.882985 -3.238519
C  -0.192705 -3.966096 -3.511446
H  -0.791703 -3.775382 -4.405728
C  -0.061569 -5.263954 -3.019383
H  -0.549694 -6.098722 -3.528806
C  0.694916 -5.489679 -1.869449
H  0.802771 -6.503289 -1.474327
C  1.323165 -4.42792 -1.218313
H  1.913531 -4.626967 -0.320469
C  3.050584 -2.408269 0.381338
C  2.381737 -2.810744 1.550723
H  1.298686 -2.686764 1.612298
C  3.091146 -3.338532 2.626919
H  2.554017 -3.651133 3.52634
C  4.481519 -3.455078 2.566042
H  5.038258 -3.858297 3.415853
C  5.15541 -3.050677 1.415321
H  6.243546 -3.136007 1.35709
C  4.444824 -2.538553 0.327484
H  4.999614 -2.237935 -0.564623
C  4.234165 0.726306 -1.224189
H  4.830376 0.066293 -0.57298
C  3.864357 0.018728 -2.513065
H  4.774098 -0.095317 -3.124845
H  3.185627 0.653799 -3.099725
C  3.222584 -1.356427 -2.354132
H  3.977573 -2.158242 -2.316935
H  2.630392 -1.569359 -3.255208
H  4.869897 1.606404 -1.414193
C  -3.740947 0.424289 -0.524907
C  -4.750333 0.771041 0.381076
C  -4.09671 0.046129 -1.823313
C  -6.089263 0.733419 0.002831
C  -5.438787 0.00032 -2.202675
C  -6.437587 0.343783 -1.291998
H  -4.475116 1.066356 1.3987
H  -3.32604 -0.216886 -2.555277
H  -6.865894 1.001126 0.724097
H  -5.703346 -0.302192 -3.218706
H  -7.487914 0.307498 -1.591076
C  -2.61253 3.067746 -0.196082
C  -3.410569 3.71475 -1.145337
C  -2.687988 3.476047 1.141693
C  -4.272606 4.74339 -0.767362
C  -3.546822 4.505811 1.521671
C  -4.344198 5.140205 0.567878
H  -3.36197 3.396569 -2.19115
H  -2.081527 2.974358 1.904156
H  -4.89185 5.237007 -1.520351
H  -3.597713 4.811376 2.569598
H  -5.019574 5.94577 0.866044
O  -2.349556 -2.806027 -1.312943
O  -0.677831 -2.7385 0.599977
C  -3.142311 -2.052929 1.085636
C  -2.870209 -1.587736 2.372667
C  -4.408908 -2.514089 0.726982
C  -3.908064 -1.544684 3.297894
C  -5.425484 -2.482029 1.673779
C  -5.200475 -1.98289 2.966443
H  -1.860156 -1.25216 2.630651
H  -4.590281 -2.885595 -0.283465
H  -3.710815 -1.170832 4.306163
H  -6.421497 -2.842495 1.402345
C  -6.317647 -1.896709 3.952265
H  -5.95293 -1.832115 4.985073
H  -6.928774 -0.998071 3.769599
H  -6.998168 -2.755281 3.876094
elementType: Ru Cl P N H C S O
totalener: -4214.33324078 hartree
cpcmener: -0.04109494 hartree
kineticenergy: 4142.32556156 hartree
exchangeener: -308.028112647863 hartree
correlationener: -15.659013981734 hartree
xcener: -322.040224689165 hartree
chargesum: 0.0000000
charge: -0.393050 -0.430573 -0.394926 0.659029 -0.207864 0.206671 0.209206 -0.098995 -0.155121 0.154125 -0.177400 0.157250 -0.137546 0.155290 -0.146040 0.158037 -0.238904 0.173041 -0.049806 -0.122871 0.160532 -0.194998 0.152967 -0.124892 0.152568 -0.195803 0.147187 -0.150253 0.127410 0.601159 -0.011652 0.189597 -0.025053 0.197488 -0.219398 0.189823 0.936382 0.005834 -0.256591 0.149730 -0.172811 0.143825 -0.145000 0.150205 -0.190276 0.150191 -0.134899 0.150780 -0.054471 -0.200111 0.156148 -0.164090 0.151888 -0.146267 0.154027 -0.182360 0.151833 -0.136443 0.150875 -0.406483 0.176713 -0.155365 0.121219 0.125889 -0.432909 0.163954 0.177336 0.166217 0.031648 -0.149146 -0.153633 -0.183514 -0.185516 -0.134996 0.141693 0.134900 0.150268 0.154152 0.155582 0.020950 -0.172618 -0.198322 -0.153823 -0.171345 -0.147132 0.138875 0.142485 0.154139 0.155202 0.154950 -0.482914 -0.468111 0.010424 -0.158615 -0.107753 -0.171194 -0.160001 0.055216 0.166227 0.155667 0.145938 0.141001 -0.296501 0.114521 0.127236 0.122857
charge: -0.860331 -0.147634 -0.149771 0.857267 0.365585 -0.024782 -0.010522 -0.210142 -0.029782 0.030472 -0.017143 0.030629 -0.015314 0.029991 -0.022853 0.030931 -0.036561 0.035440 -0.199391 -0.028859 0.031008 -0.027918 0.028092 -0.018604 0.028651 -0.023508 0.027328 -0.024895 0.014785 0.841802 -0.110291 0.040864 -0.129009 0.043231 0.154556 -0.047214 0.815007 -0.201368 -0.045827 0.011901 -0.023415 0.026823 -0.023149 0.026262 -0.027091 0.026621 -0.028324 0.027081 -0.208655 -0.031011 0.019227 -0.024838 0.028656 -0.015868 0.028624 -0.023061 0.028352 -0.036230 0.023825 -0.142401 0.022973 -0.076609 0.028936 0.009205 -0.140211 0.016018 0.022873 0.023432 -0.085215 0.011598 -0.005855 -0.015539 -0.018818 -0.021174 0.034152 0.027544 0.029099 0.029498 0.027886 -0.075396 0.003914 -0.007349 -0.017748 -0.019825 -0.020988 0.033493 0.029267 0.029641 0.029705 0.028449 -0.272608 -0.243934 -0.248479 -0.018624 -0.004397 0.000316 0.005557 -0.065867 0.016570 0.034588 0.034576 0.035402 0.020788 0.026491 0.031311 0.028105
qa: -0.3931 -0.4306 -0.3949 0.6590 -0.2079 0.2067 0.2092 -0.0990 -0.1551 0.1541 -0.1774 0.1572 -0.1375 0.1553 -0.1460 0.1580 -0.2389 0.1730 -0.0498 -0.1229 0.1605 -0.1950 0.1530 -0.1249 0.1526 -0.1958 0.1472 -0.1503 0.1274 0.6012 -0.0117 0.1896 -0.0251 0.1975 -0.2194 0.1898 0.9364 0.0058 -0.2566 0.1497 -0.1728 0.1438 -0.1450 0.1502 -0.1903 0.1502 -0.1349 0.1508 -0.0545 -0.2001 0.1561 -0.1641 0.1519 -0.1463 0.1540 -0.1824 0.1518 -0.1364 0.1509 -0.4065 0.1767 -0.1554 0.1212 0.1259 -0.4329 0.1640 0.1773 0.1662 0.0316 -0.1491 -0.1536 -0.1835 -0.1855 -0.1350 0.1417 0.1349 0.1503 0.1542 0.1556 0.0210 -0.1726 -0.1983 -0.1538 -0.1713 -0.1471 0.1389 0.1425 0.1541 0.1552 0.1550 -0.4829 -0.4681 0.0104 -0.1586 -0.1078 -0.1712 -0.1600 0.0552 0.1662 0.1557 0.1459 0.1410 -0.2965 0.1145 0.1272 0.1229
va: 4.8688 0.9895 1.0563 3.9388 3.1892 0.9820 0.9730 3.5279 3.8931 0.9960 3.9622 0.9867 3.8762 0.9859 3.9051 0.9866 3.7814 0.9952 3.6246 3.7997 0.9844 3.9383 0.9880 3.8857 0.9858 3.9620 0.9954 3.8602 1.0133 3.8804 3.8245 0.9948 3.6667 1.0003 2.9365 1.0261 5.5616 3.5308 3.8533 1.0575 3.9660 0.9888 3.9078 0.9847 3.9399 0.9875 3.8430 0.9913 3.5429 3.7747 1.0399 3.9388 0.9871 3.8869 0.9854 3.9379 0.9874 3.8159 0.9931 3.7836 0.9791 3.6054 0.9957 1.0231 3.8418 0.9875 0.9843 0.9919 3.2272 3.8322 3.9082 3.9039 3.9656 3.8664 0.9987 1.0121 0.9886 0.9869 0.9830 3.4933 3.9381 3.8735 3.8999 3.9502 3.8809 1.0030 1.0136 0.9867 0.9868 0.9853 2.0023 1.9979 3.6274 3.8303 3.8560 3.9286 3.8748 3.6882 1.0563 1.0174 0.9935 0.9949 3.8619 0.9918 0.9785 0.9863
energy: -4214.333240778502
dipole: -66.28735 64.64540 -1.64195 -5.79384 7.81025 2.01641 33.92806 -32.86726 1.06080
magnitude: 2.80842 au
magnitude: 7.13843 debye
