program: Orca
programVersion: 4.2.1
elementType: Ru Cl Cl C C C H H C C H H C H H Ru Cl Cl C C C H H C C H H C H H
elementType: Ru
charge: 0
multiplicity: 1
keywords: RKS wB97M-V def2-TZVPP def2-TZVPP/C def2/J RIJCOSX TightSCF GRID6 CPCM NBO
formula: C12H12Cl4Ru2
InChI: InChI=1S/2C6H6.2ClH.2Cl.2Ru/c2*1-2-4-6-5-3-1;;;;;;/h2*1-6H;2*1H;;;;/q;;;;;;2*+1/p-2
30 atoms
Ru 1.891885 0.124303 -0.000119
Cl -0.026072 0.383734 1.640958
Cl 2.021282 2.549454 -0.001766
C  3.047592 -0.965635 1.417263
C  3.890149 -0.069914 0.716274
C  2.217496 -1.884258 0.704595
H  4.436862 0.701087 1.260622
H  1.470516 -2.47509 1.236685
C  3.89201 -0.069358 -0.711406
C  2.219357 -1.883612 -0.705441
H  4.440099 0.702093 -1.253819
H  1.473737 -2.473966 -1.239981
C  3.051357 -0.964523 -1.415352
H  2.952411 -0.870417 -2.498621
H  2.945502 -0.872167 2.500289
Ru -1.896611 -0.066222 0.000142
Cl -0.025987 0.383424 -1.64108
Cl -1.153493 -2.386437 -0.001991
C  -3.660553 -0.187765 1.201634
C  -3.901123 -0.789207 -0.063105
C  -3.132846 1.13335 1.251969
H  -4.173805 -1.844674 -0.111792
H  -2.815206 1.543957 2.212641
C  -3.62066 -0.085604 -1.263309
C  -2.872258 1.865374 0.063684
H  -3.70296 -0.589122 -2.227561
H  -2.375365 2.835172 0.111935
C  -3.095257 1.237237 -1.187378
H  -2.749226 1.727158 -2.099773
H  -3.773631 -0.769045 2.117749
elementType: Ru Cl C H
totalener: -2495.19728938 hartree
nucrepener: 2419.26335301 hartree
electener: -4914.46064239 hartree
oneelecener: -8324.23178033 hartree
twoeener: 3409.77113794 hartree
cpcmener: -0.04121002 hartree
kineticenergy: 2369.03634405 hartree
exchangeener: -142.676089431887 hartree
correlationener: -6.814878426317 hartree
xcener: -148.821852350764 hartree
chargesum: -0.0000000
charge: 0.142033 -0.297725 -0.482961 -0.050068 -0.039735 -0.027393 0.148237 0.131928 -0.041201 -0.026376 0.148069 0.131150 -0.048430 0.150007 0.150184 0.149227 -0.298382 -0.478896 -0.048675 -0.019689 -0.065728 0.146114 0.151033 -0.048377 -0.012830 0.150934 0.148135 -0.063419 0.149679 0.153158
charge: -0.326677 0.121707 -0.206170 0.008779 0.008985 0.004866 0.054851 0.045490 0.009033 0.005218 0.054898 0.045933 0.008747 0.056020 0.056026 -0.305787 0.121591 -0.159751 0.003335 0.016933 0.015173 0.055550 0.056418 0.003123 0.009487 0.054585 0.055171 0.015621 0.056191 0.054655
qa: 0.1420 -0.2977 -0.4830 -0.0501 -0.0397 -0.0274 0.1482 0.1319 -0.0412 -0.0264 0.1481 0.1311 -0.0484 0.1500 0.1502 0.1492 -0.2984 -0.4789 -0.0487 -0.0197 -0.0657 0.1461 0.1510 -0.0484 -0.0128 0.1509 0.1481 -0.0634 0.1497 0.1532
va: 5.1460 1.1913 0.8934 3.8587 3.8549 3.7866 1.0136 1.0593 3.8549 3.7880 1.0137 1.0592 3.8558 1.0106 1.0106 5.1461 1.1912 0.8971 3.8109 3.8664 3.8965 1.0259 1.0171 3.8078 3.7738 1.0059 1.0134 3.8925 1.0184 1.0058
energy: -2495.197289383101
dipole: -1.80623 0.53293 -1.27330 -6.16480 5.12998 -1.03483 0.00820 -0.00219 0.00601
magnitude: 1.64079 au
magnitude: 4.17056 debye
