program: Orca
programVersion: 4.2.1
elementType: Ru P N C C H C H C H N C C C C H H C H H C O C H H H C H H H H H C H H H C H H H C H H H H Ru P N C C H C H C H N C C C C H H C H H C O C H H H C H H H H H C H H H C H H H C H H H H
elementType: Ru
charge: 0
multiplicity: 1
keywords: RKS wB97M-V def2-TZVPP def2-TZVPP/C def2/J RIJCOSX TightSCF GRID6 CPCM NBO
formula: C30H50N4O2P2Ru2
InChI: InChI=1S/2C14H24N2P.2CO.2Ru.2H/c2*1-12(2)17(13(3)4)10-9-15-11-14-7-5-6-8-16-14;2*1-2;;;;/h2*5-8,12-13H,9-11H2,1-4H3;;;;;;/q2*-1;;;2*+1;;
90 atoms
Ru 1.045432 -0.450328 0.800077
P  -2.816319 -1.167763 0.421562
N  -0.700329 0.656293 1.543532
C  -1.53279 0.007059 2.557515
C  -0.298698 1.937763 2.094305
H  -2.847318 -1.69387 2.83797
C  -2.104228 -1.321586 2.116065
H  -1.304678 -2.075657 2.061115
C  -4.668882 -1.096155 0.672839
H  0.200699 -1.797775 0.658382
N  1.842469 1.656479 0.977033
C  3.415262 3.455406 0.718586
C  3.034627 2.127872 0.578063
C  0.97123 2.508637 1.552761
C  2.511914 4.345596 1.29844
H  2.767222 5.400827 1.421718
H  4.400129 3.778736 0.378025
C  1.278836 3.864465 1.716533
H  0.542541 4.525704 2.179158
H  3.715181 1.399798 0.131466
C  1.72684 -1.043966 2.37377
O  2.19099 -1.47403 3.368324
C  -5.075287 -0.217301 1.844654
H  -4.679059 -0.566397 2.808238
H  -4.743684 0.823276 1.700691
H  -6.17229 -0.196246 1.938215
C  -5.381488 -0.646785 -0.593726
H  -5.088962 -1.216878 -1.486131
H  -6.471959 -0.749472 -0.480175
H  -5.171311 0.413139 -0.803028
H  -4.967361 -2.135269 0.902375
H  -1.42012 -2.920066 -0.233529
C  -3.048655 -4.011179 0.596801
H  -4.148162 -4.067376 0.590788
H  -2.683638 -4.978932 0.216784
H  -2.723354 -3.937036 1.644607
C  -2.960468 -3.022782 -1.716531
H  -2.513492 -3.922674 -2.1683
H  -4.052109 -3.135828 -1.804246
H  -2.664977 -2.162411 -2.335627
C  -2.523263 -2.877335 -0.268552
H  -0.118194 1.83513 3.188885
H  -0.951901 -0.139385 3.493956
H  -1.101677 2.703713 2.02498
H  -2.371263 0.683208 2.831008
Ru -1.813507 0.701571 -0.438951
P  2.483904 -1.710665 -0.48902
N  0.184029 0.041229 -1.215654
C  0.267119 -1.163688 -2.034009
C  0.810877 1.135601 -1.932693
H  2.293302 -1.011734 -2.80378
C  1.696673 -1.684632 -2.166094
H  1.733323 -2.674735 -2.650112
C  4.216302 -1.092371 -0.836799
H  -3.059096 1.449446 0.330074
N  -0.838714 2.583283 -0.895046
C  -0.684852 4.97495 -0.905887
C  -1.338304 3.79388 -0.586896
C  0.341377 2.499242 -1.539564
C  0.542714 4.90037 -1.565315
H  1.090653 5.808529 -1.827616
H  -1.133037 5.933004 -0.638635
C  1.059822 3.65091 -1.878936
H  2.018655 3.54868 -2.392449
H  -2.300272 3.795339 -0.069172
C  -2.714644 0.646413 -2.013156
O  -3.280266 0.630622 -3.045067
C  5.05453 -1.110663 0.430846
H  4.526346 -0.657247 1.284235
H  5.324949 -2.137951 0.722257
H  5.997696 -0.559274 0.293176
C  4.975763 -1.630964 -2.043387
H  4.335439 -1.787052 -2.923405
H  5.754437 -0.911168 -2.341621
H  5.491959 -2.576959 -1.838647
H  3.979218 -0.03892 -1.076847
H  3.01304 -3.475418 1.026447
C  1.296232 -4.219318 -0.008908
H  0.808916 -4.189575 -0.998206
H  1.428662 -5.281522 0.247857
H  0.598842 -3.788772 0.721012
C  3.65133 -4.304381 -0.843267
H  3.602532 -5.372212 -0.578937
H  3.452167 -4.235077 -1.924577
H  4.685651 -3.984348 -0.669641
C  2.64738 -3.516055 -0.016471
H  0.593475 1.049284 -3.023002
H  -0.35682 -1.942828 -1.576248
H  1.923885 1.127833 -1.880763
H  -0.154243 -0.981585 -3.047427
elementType: Ru P N C H O
totalener: -2415.33822116 hartree
nucrepener: 6705.66512367 hartree
electener: -9121.00334483 hartree
twoeener: 7615.03910888 hartree
cpcmener: -0.02661478 hartree
kineticenergy: 2286.46868017 hartree
exchangeener: -196.365481727000 hartree
correlationener: -10.962533251040 hartree
xcener: -206.159813079433 hartree
chargesum: -0.0000000
charge: 0.054859 0.435722 -0.234931 -0.192570 -0.115217 0.148561 -0.396993 0.165931 -0.065063 -0.247977 -0.103744 -0.177726 -0.022155 0.136806 -0.108772 0.160517 0.153724 -0.180793 0.141035 0.142929 0.016426 -0.295596 -0.400840 0.121397 0.138014 0.121863 -0.409562 0.133246 0.127255 0.136444 0.117950 0.039073 -0.373739 0.123545 0.123414 0.126531 -0.411263 0.132888 0.125729 0.131364 -0.041502 0.139430 0.127005 0.132885 0.149441 -0.101140 0.410783 -0.249556 -0.101436 -0.097609 0.157258 -0.418360 0.148435 -0.172242 -0.216720 -0.116735 -0.165849 0.015656 0.135932 -0.097852 0.161347 0.152585 -0.191072 0.140445 0.160274 0.025549 -0.270176 -0.377231 0.127287 0.127610 0.128831 -0.352037 0.120695 0.127991 0.119102 0.118925 0.112525 -0.399070 0.121437 0.129507 0.139575 -0.384113 0.120883 0.125017 0.124914 -0.057733 0.144110 0.111986 0.125901 0.108832
charge: -0.300710 0.890606 0.083399 -0.150964 -0.117107 0.012506 -0.145692 0.014613 -0.213640 -0.072892 0.255776 -0.025490 -0.071800 -0.122825 0.014964 0.037445 0.031971 0.002233 0.037202 0.025116 -0.316273 0.121217 -0.021219 0.011697 0.013329 0.016254 -0.018554 0.014004 0.014578 0.022805 0.019195 0.012696 -0.017621 0.013288 0.018608 0.017260 -0.020959 0.017801 0.016607 0.020419 -0.228909 0.041325 0.017523 0.033704 0.021169 -0.324705 0.872707 0.081625 -0.154368 -0.119625 0.014633 -0.146652 0.011199 -0.231427 -0.114379 0.261028 -0.023837 -0.060751 -0.118485 0.016830 0.037850 0.032759 0.002487 0.037260 0.032386 -0.317687 0.135227 -0.020404 0.020882 0.018430 0.018856 -0.014669 0.014046 0.017820 0.012261 0.016142 0.024006 -0.018747 0.017683 0.016084 0.010050 -0.015769 0.017353 0.017193 0.009760 -0.216628 0.042071 0.020086 0.029097 0.015669
qa: 0.0549 0.4357 -0.2349 -0.1926 -0.1152 0.1486 -0.3970 0.1659 -0.0651 -0.2480 -0.1037 -0.1777 -0.0222 0.1368 -0.1088 0.1605 0.1537 -0.1808 0.1410 0.1429 0.0164 -0.2956 -0.4008 0.1214 0.1380 0.1219 -0.4096 0.1332 0.1273 0.1364 0.1180 0.0391 -0.3737 0.1235 0.1234 0.1265 -0.4113 0.1329 0.1257 0.1314 -0.0415 0.1394 0.1270 0.1329 0.1494 -0.1011 0.4108 -0.2496 -0.1014 -0.0976 0.1573 -0.4184 0.1484 -0.1722 -0.2167 -0.1167 -0.1658 0.0157 0.1359 -0.0979 0.1613 0.1526 -0.1911 0.1404 0.1603 0.0255 -0.2702 -0.3772 0.1273 0.1276 0.1288 -0.3520 0.1207 0.1280 0.1191 0.1189 0.1125 -0.3991 0.1214 0.1295 0.1396 -0.3841 0.1209 0.1250 0.1249 -0.0577 0.1441 0.1120 0.1259 0.1088
va: 5.1680 3.9466 2.8211 3.8205 3.7710 0.9893 3.8165 0.9819 3.7100 0.9939 3.0861 3.9014 3.9247 3.7281 3.8633 0.9844 0.9900 3.8644 1.0007 0.9840 3.5227 2.2110 3.8294 0.9854 0.9824 0.9902 3.8597 0.9765 0.9896 0.9724 0.9856 1.0042 3.8443 0.9842 0.9854 0.9870 3.8366 0.9851 0.9824 0.9873 3.7901 0.9806 0.9811 0.9750 0.9583 5.3276 3.9401 2.7137 3.7942 3.7904 0.9790 3.8452 0.9982 3.8010 0.9897 3.1569 3.8516 3.8670 3.7269 3.8422 0.9846 0.9906 3.8718 1.0017 0.9934 3.5448 2.2363 3.8483 0.9855 0.9856 0.9845 3.8020 0.9911 0.9860 0.9848 0.9747 0.9920 3.8424 0.9787 0.9919 0.9754 3.8225 0.9948 0.9827 0.9862 3.7307 0.9841 0.9669 0.9706 0.9972
energy: -2415.338221160401
dipole: 50.08813 -47.34561 2.74252 -44.35784 46.32747 1.96963 -27.86557 27.11245 -0.75312
magnitude: 3.45948 au
magnitude: 8.79331 debye
