program: Orca
programVersion: 4.2.1
elementType: C Ru C O C C N H H C C C C N H H H N H P H C O Cl C C H H H C H H H C H H H C C H H H C H H H C H H H H H
elementType: Ru
charge: 0
multiplicity: 1
keywords: RKS wB97M-V def2-TZVPP def2-TZVPP/C def2/J RIJCOSX TightSCF GRID6 CPCM NBO
formula: C17H27ClN3O2PRu
InChI: InChI=1S/C16H26N3OP.CO.Cl.Ru.H/c1-15(2,3)21(16(4,5)6)19-13-9-7-8-12(18-13)14-17-10-11-20-14;1-2;;;/h7-9,19H,10-11H2,1-6H3;;;;/q-2;;;+2;
52 atoms
C  0.583095 3.58615 -0.032338
Ru 0.38453 -0.785022 -0.272714
C  3.135307 0.273063 -0.279246
O  4.462066 0.269979 -0.197395
C  4.873022 -1.108623 -0.420052
C  3.560084 -1.893863 -0.46767
N  2.542824 -0.857661 -0.471121
H  5.437757 -1.136872 -1.362184
H  3.405589 -2.536374 0.41373
C  2.360435 1.501723 -0.149686
C  2.86887 2.78969 -0.073873
C  1.94445 3.840823 -0.005271
C  0.13805 2.248998 -0.11816
N  1.03363 1.246578 -0.145627
H  3.944454 2.96458 -0.075238
H  2.296889 4.871945 0.061428
H  -0.14683 4.396025 0.006618
N  -1.174985 1.883852 -0.185216
H  -1.858386 2.629397 -0.077195
P  -1.658466 0.195133 -0.092324
H  0.238329 -0.5210 -1.840566
C  -0.213698 -2.49959 -0.510053
O  -0.608464 -3.587877 -0.672997
Cl 1.078597 -1.230587 2.200448
C  -2.919511 0.070882 -1.507387
C  -3.730892 -1.211016 -1.327336
H  -4.411909 -1.177812 -0.46644
H  -4.352708 -1.376741 -2.221092
H  -3.085876 -2.096406 -1.218997
C  -2.15805 -0.020248 -2.82916
H  -2.881887 0.020127 -3.658517
H  -1.45278 0.812927 -2.966831
H  -1.595173 -0.957626 -2.923697
C  -3.836231 1.29161 -1.592698
H  -3.272697 2.213731 -1.798075
H  -4.528729 1.155458 -2.438114
H  -4.452999 1.455057 -0.7031
C  -2.554179 0.12418 1.586981
C  -1.677763 0.892104 2.578058
H  -2.043528 0.698458 3.599174
H  -0.627407 0.568969 2.543136
H  -1.72796 1.979192 2.41828
C  -2.603878 -1.349604 1.995175
H  -3.120447 -1.444064 2.963721
H  -3.149571 -1.978084 1.275902
H  -1.589597 -1.758711 2.114431
C  -3.951112 0.734419 1.627729
H  -3.957482 1.794313 1.333311
H  -4.687808 0.198619 1.015027
H  -4.317409 0.696018 2.666531
H  5.542385 -1.395173 0.399825
H  3.470227 -2.532391 -1.3576
elementType: C Ru O N H P Cl
totalener: -1875.35268592 hartree
nucrepener: 3121.61331622 hartree
electener: -4996.96600214 hartree
oneelecener: -8819.16146087 hartree
twoeener: 3822.19545873 hartree
cpcmener: -0.03788299 hartree
kineticenergy: 1809.54203862 hartree
exchangeener: -137.740001173034 hartree
correlationener: -7.220459429992 hartree
xcener: -144.187882717925 hartree
chargesum: -0.0000000
charge: -0.179271 -0.205834 0.305778 -0.270650 -0.021385 -0.125481 -0.138428 0.128932 0.128553 0.132444 -0.186586 -0.085607 0.278247 -0.094902 0.157281 0.164950 0.149710 -0.248534 0.154296 0.405520 -0.080309 0.046932 -0.221149 -0.562983 0.055237 -0.420565 0.137197 0.134287 0.144352 -0.410236 0.129633 0.143057 0.141828 -0.389164 0.125363 0.128108 0.148489 0.046272 -0.395974 0.128975 0.138763 0.119190 -0.394580 0.126813 0.140169 0.138913 -0.411856 0.130651 0.134616 0.136349 0.131068 0.131521
charge: 0.006638 -0.483202 -0.291750 0.297613 -0.020963 -0.054669 0.213375 0.023321 0.029349 -0.134638 0.004919 0.026931 -0.229992 0.250063 0.036754 0.043455 0.036745 0.190454 -0.022207 0.872191 -0.082611 -0.297136 0.169425 -0.317323 -0.288961 -0.005627 0.014658 0.026918 0.023263 -0.015847 0.021719 0.020151 0.019229 -0.006650 0.017673 0.025465 0.013618 -0.289012 -0.015497 0.022331 -0.001097 0.012182 -0.012513 0.021018 0.015871 0.014792 -0.012901 0.016494 0.013753 0.025909 0.024893 0.031427
qa: -0.1793 -0.2058 0.3058 -0.2706 -0.0214 -0.1255 -0.1384 0.1289 0.1286 0.1324 -0.1866 -0.0856 0.2782 -0.0949 0.1573 0.1649 0.1497 -0.2485 0.1543 0.4055 -0.0803 0.0469 -0.2211 -0.5630 0.0552 -0.4206 0.1372 0.1343 0.1444 -0.4102 0.1296 0.1431 0.1418 -0.3892 0.1254 0.1281 0.1485 0.0463 -0.3960 0.1290 0.1388 0.1192 -0.3946 0.1268 0.1402 0.1389 -0.4119 0.1307 0.1346 0.1363 0.1311 0.1315
va: 3.9521 5.3488 4.0372 2.1524 3.8128 3.8777 3.1342 0.9812 0.9989 3.8506 3.9660 3.9366 3.9830 3.1975 1.0025 0.9831 0.9938 3.2374 1.0151 4.0622 1.0192 3.6166 2.3043 0.7804 3.7901 3.8163 0.9829 0.9940 0.9864 3.8187 0.9932 0.9819 0.9794 3.7907 0.9929 0.9917 0.9771 3.7853 3.7423 0.9920 1.0491 0.9931 3.7868 0.9911 0.9775 1.0210 3.7835 0.9780 0.9834 0.9961 0.9805 0.9771
energy: -1875.352685923818
dipole: -52.50459 52.25579 -0.24879 57.97290 -54.00983 3.96308 12.89107 -14.90257 -2.01151
magnitude: 4.45129 au
magnitude: 11.31429 debye
