program: Gaussian 16
title: C45
version: ES64L-G16RevC.01
frameworkgroup: C1[X(C33H40Cl2N2P2Ru)]
method: RM06L
basis: def2SVP/W06
operation: Freq
keyword: #P
keyword: Geom=AllCheck
keyword: Guess=TCheck
keyword: SCRF=Check
keyword: GenChk
keyword: RM06L/def2SVP/W06
keyword: Freq
converged: YES YES NO YES
polarizability: 6.86560178e+02 -1.27804460e+01 7.01306931e+02 -2.82287928e+01 -6.49448382e+01 5.74868843e+02
1716.lowfreq: 0.0019 0.0019 0.0020 5.4366 8.0880 10.7784 22.7279 29.7588 37.3186
frequency: 22.1867 29.7397 37.3094 40.5977 45.5662 51.4883 57.4417 61.3968 67.1659 72.8767 75.1816 80.2015 91.3631 101.9684 105.1522 112.8709 117.7398 129.0266 138.6707 152.8327 165.0861 179.0595 182.9866 188.9597 201.4973 212.8742 219.2688 220.7592 224.8775 228.9786 236.7087 249.0786 256.9501 263.4369 264.7786 269.5529 275.5574 288.0534 300.2904 333.4575 338.4851 352.2034 364.6546 407.8567 410.3615 415.3927 416.6798 418.5731 419.7235 424.6938 456.0674 456.4008 462.8958 470.4139 491.8128 497.1627 507.0604 522.1423 522.9931 526.4652 540.7029 554.7873 624.3009 625.1501 625.7594 626.8320 627.3433 655.6128 662.9988 687.7200 701.4344 703.0950 706.3145 713.2523 717.1868 717.2214 719.8384 726.1527 754.2714 759.9178 760.8813 764.8041 768.7184 794.3213 824.4537 856.6860 858.5930 859.7526 864.8608 869.0452 875.0235 900.0408 926.2842 930.7915 932.9958 933.9544 936.8298 950.6204 970.2394 975.0560 988.9976 991.1068 993.3146 1007.1710 1011.6477 1012.2628 1012.3389 1013.4105 1013.5820 1013.9257 1015.7256 1025.7174 1037.2703 1045.9191 1053.1814 1053.7767 1053.8487 1055.1242 1055.5857 1065.4499 1084.9960 1094.7270 1097.9951 1100.0967 1102.6200 1103.6811 1105.1750 1107.1148 1116.7478 1118.7907 1122.7728 1126.7079 1137.1632 1153.0453 1154.6805 1154.8933 1155.3300 1156.1430 1164.3972 1184.5318 1186.9028 1188.3775 1190.5715 1192.6063 1194.9229 1212.3072 1248.8570 1253.7230 1276.8422 1280.2611 1305.1267 1308.3049 1313.0316 1313.1890 1318.5320 1323.8555 1324.3658 1342.6774 1355.0127 1377.9595 1380.7419 1382.9319 1386.1276 1391.1576 1394.2668 1395.6366 1397.6192 1397.9679 1406.5096 1412.4910 1422.7955 1433.2558 1435.7725 1443.3310 1444.6246 1456.6139 1459.6606 1460.0078 1463.8240 1465.0141 1508.7253 1511.0466 1511.6141 1512.8519 1591.2293 1599.3570 1636.0867 1636.6847 1638.3724 1639.7849 1654.2070 1654.2713 1655.5361 1655.8216 3015.4862 3016.7234 3027.9591 3029.2485 3030.0161 3045.0236 3047.7656 3049.6321 3061.6912 3094.8667 3095.8497 3101.9240 3105.3139 3114.8174 3125.7142 3135.1161 3136.3576 3150.0141 3166.6710 3170.8269 3172.0696 3172.6717 3173.0731 3179.1222 3179.5793 3180.2977 3181.2887 3188.3280 3188.3445 3190.1233 3192.8439 3194.2133 3196.5372 3196.7671 3197.9507 3204.6932 3466.4472 3468.2701 3561.9495 3564.6137
redmass: 5.0957 5.0027 4.9312 5.2006 5.3075 5.0042 4.7026 5.1355 4.4617 3.7089 3.9326 4.5224 4.4487 5.0565 6.2114 6.0005 6.6712 6.1034 10.9483 6.4237 5.5366 5.7322 4.2051 2.4749 4.2353 4.3221 4.1977 2.6011 4.1974 4.3271 3.8025 6.7952 7.9154 4.5407 6.1478 5.2505 4.3149 3.0560 9.7220 1.6853 1.8742 4.9877 4.5147 2.9319 3.0455 2.9225 3.3995 3.3062 3.2417 3.6972 5.3262 6.5295 5.7263 2.8514 3.4120 3.6074 3.2676 3.8048 3.6079 2.5287 4.2108 1.6189 4.2855 3.9493 2.7623 6.3411 4.1378 3.8530 1.6828 4.6445 5.6718 6.2630 4.0816 3.2263 1.5249 1.7438 1.6631 1.6471 1.7627 2.2464 2.3082 2.1713 2.2099 1.8284 2.3507 1.6557 1.2475 1.2456 1.2485 1.5857 1.2492 2.1720 1.5836 1.3693 1.3578 1.3820 1.9093 1.3541 2.0534 1.9681 1.3823 1.3884 1.3737 1.3543 3.6940 1.9249 4.3202 3.4961 1.2994 2.9654 1.6641 1.2870 1.4232 1.4371 2.5905 2.5173 2.5828 1.8612 2.1025 1.1908 1.4073 1.4426 1.5292 2.0878 1.5286 1.5173 1.5243 1.4832 2.6843 2.6888 2.7983 2.5177 1.1530 1.9124 1.0621 1.0618 1.0581 1.0598 1.7571 1.1231 1.4071 1.6937 1.1201 1.1297 1.3412 1.6188 1.2145 1.3715 1.5130 1.2309 1.3021 1.3519 1.2766 1.3529 1.3555 1.3297 1.3335 1.2852 1.4773 1.3900 1.6368 1.4357 1.6610 1.6113 5.6814 5.2754 5.4934 6.3090 1.1563 1.1167 1.3286 1.0991 1.0855 1.1225 1.2463 1.1697 2.4331 2.4038 2.4438 2.4361 2.2571 2.2027 2.2137 2.2247 1.0917 1.0964 5.8978 5.9281 6.0388 6.1138 6.1519 6.1940 6.1316 6.1184 1.0665 1.0670 1.0680 1.0647 1.0820 1.0649 1.0849 1.0656 1.0653 1.1010 1.1009 1.1001 1.1034 1.1024 1.1003 1.0990 1.0941 1.0895 1.0851 1.0847 1.0859 1.0857 1.0887 1.0891 1.0913 1.0908 1.0943 1.0949 1.0928 1.0938 1.0998 1.0949 1.0999 1.1006 1.0999 1.0932 1.0538 1.0544 1.0933 1.0919
irintensity: 0.1332 0.0445 0.6959 0.0459 0.9255 0.4056 0.2842 0.6466 0.1119 0.2674 0.3490 3.8725 0.2769 2.2446 2.7003 1.3060 4.3208 1.5477 8.6884 13.6973 15.1999 0.9618 5.1755 2.1008 0.2835 2.7375 1.0786 17.1439 9.6210 1.1716 18.2981 0.9257 3.1150 1.3648 6.3895 1.0012 2.1457 0.8529 25.1698 2.1420 8.5206 7.7668 2.7365 0.2947 0.9616 1.2843 5.4322 15.3372 4.8203 22.5029 36.6560 53.8559 66.5471 10.0023 20.2472 23.5249 41.3914 106.4674 79.7869 10.9090 110.3657 10.4222 1.3314 1.4016 3.4413 3.4352 0.8198 123.3989 14.8009 48.8286 16.3898 11.1733 24.1159 59.8560 85.1895 23.2267 35.8046 44.0836 19.0400 11.7635 8.6607 9.2757 11.5664 0.0975 39.2712 0.2238 0.7020 1.5499 0.2761 2.6012 1.7447 0.8998 14.4641 3.1888 0.1648 1.2320 5.3606 0.2564 27.8704 0.5423 0.3802 1.2412 0.1985 2.0070 1.3709 0.5534 0.5329 0.5332 0.1045 0.3426 1.9106 17.8224 166.4217 31.9106 6.0357 8.1659 7.0087 50.9924 52.5568 8.4119 23.1240 10.6261 6.9343 21.9881 3.9808 1.1299 7.0106 3.7546 27.8198 40.2142 17.5009 16.6540 5.8834 26.1200 0.2306 0.2135 0.0746 0.1579 2.6411 5.5282 15.0191 6.1914 1.9489 8.6052 3.5697 2.9532 6.2172 5.5337 2.8267 3.9721 1.1798 0.8424 5.0214 10.4659 5.3827 2.1687 7.0651 3.1384 1.8508 8.7821 0.2392 0.4651 4.3067 0.7783 2.0316 4.8328 1.9129 1.6052 17.3380 8.3933 10.6858 21.3487 9.2892 8.8683 0.2117 6.7245 20.7510 21.8079 18.4779 19.9936 7.1231 14.4964 8.3862 8.4117 68.7277 38.6846 1.6034 1.2320 0.3184 3.8780 0.8110 1.7295 11.6851 0.9724 93.4763 1.3140 57.0031 68.9498 24.5195 34.6384 40.6022 57.0610 44.1660 92.6076 6.2335 66.1200 64.8937 7.6418 5.5208 10.2702 21.8699 6.0546 2.5235 0.3440 1.5771 0.8051 1.6666 9.8849 15.2759 8.9582 37.8936 25.3308 30.1473 13.5659 39.3339 18.9957 46.7250 31.7840 25.9899 17.8457 19.6681 12.4833 48.0910 31.4342
temp: 298.150 k
press: 1.00000 atm
elementType: 44 17 17 15 7 1 1 6 6 1 6 1 6 1 6 1 6 1 6 6 1 6 1 6 1 6 1 6 1 15 7 1 1 6 6 1 6 1 6 1 6 1 6 1 6 6 1 6 1 6 1 6 1 6 1 6 1 6 1 1 6 1 1 1 6 6 6 6 6 6 1 1 1 1 1 1 1 1 1 1
symmnumber: 1
zpe: 1749020.6 jmol-1
zpe.correction: 0.666167 hartree
zpe.thermalcorrener: 0.705419 hartree
zpe.thermalcorrenthalpy: 0.706364 hartree
zpe.thermalcorrgfe: 0.595094 hartree
zpe.sumelectzpe: -3087.142953 hartree
zpe.sumelectthermal: -3087.103701 hartree
zpe.sumelectthermalent: -3087.102756 hartree
zpe.sumelectthermalfe: -3087.214026 hartree
hfenergy: -3087.8091201 hartree
pointgroup: C01 [X(C33H40Cl2N2P2Ru1)]
dipole: 0.0702278 0.7000933 -0.5687576 debye
polarizability: 687.9581939|-35.2120242|698.2232826|-50.3805476|-40.3304142|576.5544755 unknown
InChI: InChI=1S/C27H26P2.C6H14N2.2ClH.Ru/c1-5-14-24(15-6-1)28(25-16-7-2-8-17-25)22-13-23-29(26-18-9-3-10-19-26)27-20-11-4-12-21-27;7-5-3-1-2-4-6(5)8;;;/h1-12,14-21H,13,22-23H2;5-6H,1-4,7-8H2;2*1H;/q;;;;+2/p-2
charge 0 multiplicity 1
80 atoms
Ru 2.5258181 2.1282414 0.53392417
Cl 2.22232928 0.06838574 -0.80637524
Cl 2.7033524 4.49460561 1.28882324
P  1.21879439 1.57193602 2.30570878
N  0.90606959 2.89220043 -0.77554353
H  0.43490961 2.07102437 -1.1646765
H  0.20026253 3.42358498 -0.26328573
C  -0.2415223 2.68048607 2.38775027
C  -0.26922987 3.82485614 3.19494766
H  0.55991347 4.03969469 3.87383282
C  -1.34968856 4.70655499 3.1404716
H  -1.35520584 5.59354056 3.77901763
C  -2.41669607 4.46032598 2.27720892
H  -3.26204187 5.15158462 2.23688488
C  -2.39928294 3.32449933 1.46520816
H  -3.23292531 3.12026546 0.78836527
C  -1.31922491 2.44531989 1.51788511
H  -1.31313063 1.55720228 0.875821
C  0.43931224 -0.08885008 2.52634349
C  -0.75223359 -0.24918306 3.25080148
H  -1.2893894 0.62668379 3.62654588
C  -1.2630371 -1.52113272 3.50762982
H  -2.19323739 -1.62702114 4.07196115
C  -0.58720218 -2.65302659 3.05053376
H  -0.98864993 -3.64994018 3.24990731
C  0.60336017 -2.50471108 2.33987822
H  1.13904099 -3.38630508 1.97738608
C  1.11440004 -1.23269119 2.07871798
H  2.03739719 -1.12038378 1.50647067
P  4.32381094 1.53604108 1.77003217
N  3.63281177 2.86497039 -1.23461477
H  4.04099219 3.76485162 -0.96642767
H  4.41251621 2.26225663 -1.50268381
C  5.95685588 2.02256351 1.05147041
C  6.1172606 3.37547498 0.70468474
H  5.29328854 4.07540217 0.89002461
C  7.30463501 3.8317415 0.13731468
H  7.41066897 4.88855117 -0.12133623
C  8.3546038 2.94267112 -0.10117073
H  9.28544094 3.29772026 -0.55029428
C  8.20892372 1.60026011 0.24280816
H  9.02809763 0.89777296 0.06899754
C  7.02107915 1.14218024 0.81743388
H  6.93749285 0.08782999 1.09127585
C  4.56530789 -0.24449354 2.15606499
C  4.70138453 -1.13891707 1.07985745
H  4.71226343 -0.7534978 0.05796121
C  4.8051501 -2.51004216 1.299928
H  4.91375501 -3.18750779 0.44905902
C  4.76010232 -3.01858093 2.59965652
H  4.83019656 -4.09556098 2.77175568
C  4.62619764 -2.14360334 3.67582473
H  4.59483919 -2.52994324 4.69769971
C  4.53654842 -0.76755375 3.45618081
H  4.44217456 -0.10521374 4.32008169
C  1.99305989 1.69554362 3.99115916
H  2.34610516 0.67789344 4.22548163
C  3.1190163 2.70740388 4.13932936
H  3.34686808 2.81568197 5.21236065
H  2.76423325 3.69253453 3.80532529
C  4.4280643 2.39748471 3.40777169
H  5.13364406 1.83670806 4.04177109
H  4.93581566 3.34702793 3.18268183
H  1.18647168 1.89563638 4.7155437
C  2.72878571 3.06243932 -2.37808029
C  3.34936765 3.87223294 -3.50668566
C  2.35762507 4.10644719 -4.63594102
C  1.08513542 4.76406998 -4.12359044
C  0.46152402 3.95493154 -2.99657615
C  1.45160557 3.71521019 -1.86633895
H  2.46698233 2.0535411 -2.74466021
H  4.25560089 3.36371649 -3.87264029
H  3.68385439 4.84379352 -3.09777505
H  2.81901103 4.71615642 -5.42770048
H  2.10581218 3.13868058 -5.1049138
H  0.36064631 4.89948464 -4.94107359
H  1.32088014 5.77834499 -3.75526294
H  -0.43819068 4.45244472 -2.60059427
H  0.1279816 2.9740409 -3.38295994
H  1.732527 4.68337912 -1.41206402
