program: Orca
programVersion: 5.0.1
elementType: O O N C C C C C C H H H H H H O H H O H H O H H
charge: 1
multiplicity: 1
keywords: wB97X-D3 Opt Freq def2-TZVPP def2/J RIJCOSX TightSCF
keywords: PAL8 defgrid3 TightOpt
frequency: 0.00 0.00 0.00 0.00 0.00 0.00 23.15 29.68 49.90 63.04 82.51 90.08 120.84 132.17 180.26 197.42 213.99 235.28 242.09 263.14 302.71 315.14 354.62 356.55 419.33 421.70 453.64 496.48 533.63 601.01 643.58 700.80 702.15 769.94 830.65 869.16 907.47 981.39 1015.01 1057.09 1072.86 1082.49 1118.31 1133.86 1149.33 1189.03 1214.34 1302.86 1354.32 1390.98 1414.17 1519.88 1550.40 1627.09 1631.95 1653.90 1675.51 1699.59 1715.82 1817.06 2611.77 3192.26 3227.48 3245.22 3256.34 3257.79 3440.15 3777.39 3878.57 3946.32 3959.92 3969.72
formula: C6H12NO5
InChI: InChI=1S/C6H6NO2.3H2O/c8-6(9)5-2-1-3-7-4-5;;;/h1-4,7-8H;3*1H2
24 atoms
O  -1.293722 -1.173164 -0.004887
O  -1.965946 0.974781 0.038522
N  2.614653 -0.094133 0.002066
C  0.341371 0.494105 0.009886
C  0.709383 1.833424 0.012371
C  1.330567 -0.464825 0.004766
C  2.051655 2.187053 0.008764
C  2.997479 1.190055 0.003728
C  -1.118015 0.113693 0.015676
H  -0.071718 2.58354 0.01714
H  1.118965 -1.524521 0.003591
H  2.362251 3.221542 0.010122
H  4.062653 1.372927 0.001114
H  -2.285515 -1.445299 0.010501
H  3.34379 -0.828993 -0.001153
O  -3.72417 -1.858473 0.096927
H  -4.074806 -2.505732 -0.513952
H  -4.291773 -1.058262 0.040574
O  4.570902 -2.021273 -0.005785
H  4.962489 -2.438259 -0.774357
H  4.960052 -2.444947 0.760382
O  -4.790977 0.562393 -0.131209
H  -3.931634 0.992872 -0.042863
H  -5.399095 1.021348 0.4469
totalener: -666.66570288 hartree
nucrepener: 705.79502131 hartree
electener: -1372.46072419 hartree
oneelecener: -2298.28150863 hartree
twoeener: 925.82078443 hartree
kineticenergy: 664.06934882 hartree
temp: 298.15 k
press: 1.00 atm
thermalcorrenthalpy: 0.00094421 hartree
totalenthalpy: -666.46309095 hartree
chargesum: 1.0000000
charge: -0.337673 -0.417335 -0.106127 -0.081948 -0.029391 0.098589 -0.099276 0.085970 0.462243 0.174717 0.176659 0.169356 0.172451 0.260502 0.243664 -0.380710 0.213049 0.248237 -0.384223 0.238970 0.239129 -0.392683 0.233431 0.212401
charge: 0.359190 0.121736 0.439734 -0.055304 0.110923 0.054269 0.031875 0.033224 -0.452331 0.054730 0.045684 0.046125 0.042722 -0.176547 -0.041011 0.422224 -0.116961 -0.171520 0.367508 -0.102251 -0.102158 0.360435 -0.149367 -0.122928
qa: -0.3377 -0.4173 -0.1061 -0.0819 -0.0294 0.0986 -0.0993 0.0860 0.4622 0.1747 0.1767 0.1694 0.1725 0.2605 0.2437 -0.3807 0.2130 0.2482 -0.3842 0.2390 0.2391 -0.3927 0.2334 0.2124
va: 2.1454 2.0767 3.4940 3.8125 3.9866 3.9480 3.9769 3.9099 4.1991 1.0083 1.0099 0.9933 0.9932 1.0979 1.0480 2.1445 1.0316 1.0693 2.1234 1.0107 1.0105 2.1112 1.0439 1.0324
dispcorr: -0.007621598 hartree
energy: -666.673383062475
dipole: 0.74735 2.98894 3.73629 -3.15015 2.80876 -0.34139 -0.07427 0.06433 -0.00994
magnitude: 3.75187 au
magnitude: 9.53650 debye
zeropoint: 0.19303431 hartree
thermalvibcorrection: 0.01338121 hartree
thermalrotcorrection: 0.00141627 hartree
thermaltrasncorrection: 0.00141627 hartree
thermaltotal: -666.46413500 hartree
thermalcorr: 0.01621375 hartree
nonthermalcorr: 0.19303431 hartree
totalcorr: 0.20924807 hartree
totalenthalpy: -666.46319079 hartree
