program: Orca
programVersion: 5.0.1
elementType: O O N C C C C C C H H H H H H O H H O H H
charge: 1
multiplicity: 1
keywords: wB97X-D3 Opt Freq def2-TZVPP def2/J RIJCOSX TightSCF
keywords: PAL8 defgrid3 TightOpt
frequency: 0.00 0.00 0.00 0.00 0.00 0.00 15.85 27.70 39.41 54.55 98.67 103.41 166.33 194.21 200.04 209.84 231.65 286.13 307.54 383.42 414.74 435.48 501.27 537.69 616.13 640.19 659.50 706.51 772.93 798.65 803.03 871.62 988.44 1020.81 1055.28 1074.10 1085.03 1136.68 1162.05 1215.40 1224.47 1226.20 1310.34 1358.77 1413.88 1423.80 1525.13 1631.92 1644.26 1672.48 1703.13 1720.79 1877.26 2907.15 3225.90 3244.34 3255.66 3257.14 3524.89 3819.73 3886.43 3949.95 3980.43
formula: C6H10NO4
InChI: InChI=1S/C6H6NO2.2H2O/c8-6(9)5-2-1-3-7-4-5;;/h1-4,7-8H;2*1H2
21 atoms
O  -2.214018 -2.189135 0.29973
O  -3.747487 -0.673075 -0.328802
N  0.745659 0.601168 0.318681
C  -1.506676 0.029095 -0.016274
C  -1.777617 1.354168 -0.337894
C  -0.215933 -0.325053 0.313111
C  -0.757307 2.293013 -0.32306
C  0.511909 1.882894 0.013669
C  -2.627502 -0.967952 -0.038582
H  -2.793304 1.62764 -0.596275
H  0.072742 -1.333108 0.574319
H  -0.941319 3.328624 -0.56852
H  1.365214 2.545435 0.050926
H  -2.969384 -2.789093 0.271274
H  1.724565 0.313525 0.573289
O  3.225764 -0.105448 0.943659
H  3.906426 -0.399387 0.306037
H  3.616771 -0.136327 1.815807
O  5.040899 -0.913953 -0.889295
H  5.771264 -0.382467 -1.20683
H  5.286126 -1.826513 -1.043502
totalener: -590.20179772 hartree
nucrepener: 591.68820127 hartree
electener: -1181.88999898 hartree
oneelecener: -1965.86075728 hartree
twoeener: 783.97075830 hartree
kineticenergy: 587.89275636 hartree
temp: 298.15 k
press: 1.00 atm
thermalcorrenthalpy: 0.00094421 hartree
totalenthalpy: -590.02512613 hartree
chargesum: 1.0000000
charge: -0.259516 -0.288253 -0.100472 -0.126467 -0.020673 0.097723 -0.098674 0.085786 0.418745 0.175606 0.172792 0.169722 0.171032 0.228268 0.243518 -0.435269 0.264682 0.225863 -0.384179 0.229959 0.229806
charge: 0.382709 0.161665 0.439342 -0.064288 0.111926 0.049606 0.032696 0.034675 -0.431466 0.056786 0.045412 0.046193 0.043253 -0.069396 -0.067761 0.374116 -0.174380 -0.116680 0.364628 -0.109483 -0.109552
qa: -0.2595 -0.2883 -0.1005 -0.1265 -0.0207 0.0977 -0.0987 0.0858 0.4187 0.1756 0.1728 0.1697 0.1710 0.2283 0.2435 -0.4353 0.2647 0.2259 -0.3842 0.2300 0.2298
va: 2.2257 2.2020 3.4604 3.8144 3.9737 3.9465 3.9747 3.9172 4.2572 1.0059 1.0088 0.9930 0.9945 1.0244 1.0606 2.0686 1.0542 1.0186 2.1103 1.0170 1.0171
dispcorr: -0.005812905 hartree
energy: -590.207717930450
dipole: 14.97707 -11.98379 2.99328 0.92317 -0.56747 0.35570 0.14570 -0.01124 0.13446
magnitude: 3.01734 au
magnitude: 7.66947 debye
zeropoint: 0.16766927 hartree
thermalvibcorrection: 0.01103820 hartree
thermalrotcorrection: 0.00141627 hartree
thermaltrasncorrection: 0.00141627 hartree
thermaltotal: -590.02617792 hartree
thermalcorr: 0.01387074 hartree
nonthermalcorr: 0.16766927 hartree
totalcorr: 0.18154001 hartree
totalenthalpy: -590.02523371 hartree
