program: Orca
programVersion: 5.0.1
elementType: Cl Cl N N N C C C C C C C C C H H H H H H H H H H C N C H H H C N C H H H
charge: 1
multiplicity: 1
keywords: wB97X-D3 Opt Freq def2-TZVPP def2/J RIJCOSX TightSCF
keywords: PAL8 defgrid3 TightOpt
frequency: 0.00 0.00 0.00 0.00 0.00 0.00 -27.63 6.15 15.43 18.18 22.87 23.72 27.64 45.80 53.70 65.26 69.12 85.07 100.62 107.18 127.69 131.50 156.39 176.55 205.17 209.50 299.07 316.65 328.17 403.04 404.28 406.62 407.93 417.01 452.54 506.37 528.77 551.03 561.68 620.67 670.47 715.12 719.74 735.99 758.25 808.11 825.42 834.55 883.45 907.79 943.40 946.77 950.31 962.06 1036.62 1050.66 1062.63 1062.89 1063.17 1064.19 1069.44 1109.50 1137.99 1143.58 1161.03 1192.62 1240.62 1241.37 1261.87 1291.73 1297.44 1328.21 1354.84 1394.73 1416.35 1416.65 1470.73 1471.05 1472.77 1473.24 1477.89 1495.52 1499.38 1522.32 1539.99 1545.55 1649.38 1662.97 1677.86 1744.79 2412.92 2425.23 3081.73 3087.17 3087.79 3088.01 3153.79 3164.37 3175.86 3176.57 3176.82 3177.76 3215.77 3236.70 3241.20 3406.00 3526.84 3651.19
formula: C13H16Cl2N5
InChI: InChI=1S/C9H10Cl2N3.2C2H3N/c10-6-2-1-3-7(11)8(6)14-9-12-4-5-13-9;2*1-2-3/h1-3,12-14H,4-5H2;2*1H3
36 atoms
Cl 1.343141 -0.283523 2.103017
Cl -2.41195 -0.975376 -1.699718
N  -0.279428 2.768822 -0.632154
N  -0.748619 0.626795 0.175572
N  1.005003 1.12492 -1.318966
C  0.794957 3.45012 -1.348572
C  1.463971 2.278997 -2.088118
C  -0.02877 1.459526 -0.565893
C  -0.529892 -0.772163 0.221365
C  0.407602 -1.320829 1.096041
C  -1.266917 -1.631178 -0.59298
C  0.596973 -2.690367 1.166009
C  -1.088706 -3.00209 -0.526248
C  -0.157981 -3.522112 0.356944
H  1.480612 3.930561 -0.648254
H  0.400139 4.199592 -2.029792
H  1.121516 2.203772 -3.121366
H  2.548784 2.346029 -2.079422
H  -0.913232 3.206327 0.016885
H  -1.497411 1.045035 0.716712
H  1.323786 -3.092789 1.857173
H  -1.680811 -3.647898 -1.159019
H  -0.023309 -4.593967 0.420518
H  1.277552 0.165211 -1.532921
C  -3.482414 3.03838 2.053234
N  -2.594006 2.641787 1.447704
C  -4.60893 3.539979 2.820602
H  -4.553783 3.164176 3.840773
H  -4.584741 4.628239 2.837606
H  -5.539918 3.208787 2.363856
C  2.233576 -2.594563 -2.392831
N  1.906041 -1.540018 -2.091067
C  2.648536 -3.933595 -2.773585
H  3.497815 -3.876941 -3.452103
H  2.937071 -4.4940 -1.88605
H  1.826606 -4.445062 -3.271365
totalener: -1699.07570966 hartree
nucrepener: 1785.44198050 hartree
electener: -3484.51769016 hartree
oneelecener: -5857.61339137 hartree
twoeener: 2373.09570121 hartree
kineticenergy: 1694.33443700 hartree
temp: 298.15 k
press: 1.00 atm
thermalcorrenthalpy: 0.00094421 hartree
totalenthalpy: -1698.78604842 hartree
chargesum: 1.0000000
charge: -0.022138 -0.021890 -0.209428 -0.209796 -0.194329 -0.039586 -0.038499 0.376322 0.051864 0.000715 0.005348 -0.076802 -0.098075 -0.153853 0.110417 0.111712 0.106567 0.112255 0.192361 0.245179 0.137531 0.137344 0.149856 0.219748 -0.075346 -0.204843 -0.052411 0.125941 0.123698 0.126047 -0.114484 -0.134087 -0.063167 0.132461 0.119828 0.123543
charge: 0.455891 0.452943 0.354941 0.359512 0.368978 -0.007484 -0.001863 -0.274647 -0.195265 -0.384664 -0.385281 -0.022899 -0.024866 0.008976 0.021032 0.024002 0.022763 0.025364 -0.028805 -0.025787 0.031514 0.030980 0.033296 -0.070361 -0.110889 0.032747 0.036341 0.048936 0.048887 0.048768 -0.119812 0.075431 0.030894 0.048625 0.045386 0.046416
qa: -0.0221 -0.0219 -0.2094 -0.2098 -0.1943 -0.0396 -0.0385 0.3763 0.0519 0.0007 0.0053 -0.0768 -0.0981 -0.1539 0.1104 0.1117 0.1066 0.1123 0.1924 0.2452 0.1375 0.1373 0.1499 0.2197 -0.0753 -0.2048 -0.0524 0.1259 0.1237 0.1260 -0.1145 -0.1341 -0.0632 0.1325 0.1198 0.1235
va: 1.3008 1.3021 3.2586 3.1976 3.2628 3.9233 3.9210 4.1780 3.5456 4.0587 4.0579 3.9385 3.9335 3.9227 1.0013 1.0011 1.0034 1.0013 1.0270 0.9943 1.0088 1.0090 0.9942 1.0405 3.8313 3.0515 3.8499 1.0000 1.0010 0.9997 3.8468 3.1069 3.8474 1.0015 1.0003 0.9999
dispcorr: -0.018130400 hartree
energy: -1699.093635849740
dipole: 2.61018 -2.90662 -0.29644 6.62131 -5.70412 0.91719 -4.96558 4.80979 -0.15579
magnitude: 0.97641 au
magnitude: 2.48184 debye
zeropoint: 0.28272089 hartree
thermalvibcorrection: 0.02001340 hartree
thermalrotcorrection: 0.00141627 hartree
thermaltrasncorrection: 0.00141627 hartree
thermaltotal: -1698.78806902 hartree
thermalcorr: 0.02284594 hartree
nonthermalcorr: 0.28272089 hartree
totalcorr: 0.30556683 hartree
totalenthalpy: -1698.78712481 hartree
