program: Gaussian 09
title: 000003331
version: EM64L-G09RevD.01
frameworkgroup: C1[X(C11H14N2O4)]
method: RPBEPBE
basis: SDD
operation: Freq
keyword: #p
keyword: freq=noraman
keyword: PBEPBE/SDD
title: #p freq=noraman PBEPBE/SDD
converged: YES YES NO NO
title: Mulliken charges:
elementType: O O O O N N C C C C C C C C C C C H H H H H H H H H H H H H H
charge: -0.291074 -0.291344 -0.281114 -0.281046 -0.617401 -0.617408 -0.297609 0.593814 -0.295026 -0.293843 -0.410633 -0.439191 -0.243447 -0.232645 -0.245924 0.299012 0.299081 0.241267 0.223736 0.233209 0.223428 0.234044 0.225374 0.230962 0.224855 0.223817 0.228000 0.337778 0.340828 0.337659 0.340839
chargesum: 0.00000
title: Mulliken charges with hydrogens summed into heavy atoms:
elementType: O O O O N N C C C C C C C C C C C
charge: -0.291074 -0.291344 -0.281114 -0.281046 0.061206 0.061090 -0.056341 0.593814 0.161919 0.163630 -0.185259 -0.208229 -0.018592 -0.008828 -0.017924 0.299012 0.299081
polarizability: 1.40123628e+02 -1.11299310e-01 1.50000810e+02 5.49859450e-01 -1.29620696e+01 1.28651903e+02
1716.lowfreq: -13.0304 -5.2328 -0.0002 0.0004 0.0006 3.8973 11.5840 14.1478 32.2100
frequency: 10.5568 14.0578 32.1280 33.8376 36.5768 59.4757 110.4380 149.3454 149.7798 175.3825 201.6321 209.6497 242.9417 248.1340 405.6678 419.5975 422.7727 452.8322 492.5595 494.2018 506.4459 515.9591 516.9945 550.7631 554.7997 614.9135 627.8614 639.7697 703.4342 704.6916 706.1506 743.7548 771.8232 820.5007 845.8103 850.5718 913.5143 929.2769 974.5298 989.9133 994.0850 1008.8314 1012.0123 1029.2918 1037.4551 1058.4032 1058.6612 1071.8629 1091.1549 1108.0770 1172.0590 1189.8738 1199.8979 1207.4716 1215.5264 1268.4758 1296.5808 1303.5093 1312.8288 1360.3210 1379.4292 1384.7135 1390.9486 1444.9147 1476.6004 1482.6377 1487.5388 1587.9120 1588.9938 1596.1540 1615.2415 1686.9535 1688.8610 2996.2616 3001.3629 3015.9310 3059.1521 3068.4200 3109.7215 3119.3549 3132.3710 3143.6386 3161.8210 3559.1580 3559.3255 3717.5896 3717.6645
redmass: 7.2435 8.3132 4.9226 4.9046 3.6924 5.4459 5.6655 4.4984 6.6129 3.3550 9.9746 2.8756 3.5354 3.7498 2.8070 3.8642 3.9092 3.1906 1.1730 1.1676 3.2916 1.0631 1.0715 3.3612 3.0014 6.4834 5.8889 4.3800 3.8289 11.3554 2.3266 3.8711 1.8982 4.6762 5.2472 1.2524 1.3540 1.6498 1.3916 5.6502 1.3163 10.3525 2.5342 2.5379 3.0749 2.2735 2.0241 2.0677 2.8988 2.3558 1.0541 1.1154 1.1102 1.4616 1.5532 1.2288 2.4439 2.3577 1.5259 1.6912 1.7090 1.8555 2.7820 2.0987 1.0809 1.4881 1.4656 1.2121 1.2142 6.0063 6.1414 7.4411 7.5441 1.0570 1.0582 1.0842 1.1070 1.1058 1.0875 1.0858 1.0907 1.0959 1.1014 1.0445 1.0446 1.1058 1.1058
irintensity: 1.4894 0.0664 8.3614 0.1708 0.0052 2.6461 0.4567 12.8487 16.2424 4.8660 1.0674 2.4725 4.6175 4.3697 0.0363 9.4082 5.1776 0.5473 1.5284 542.9405 7.9452 1.4565 91.4318 39.8055 0.1472 0.3271 3.7755 3.3453 18.9912 65.9770 38.7769 0.1840 40.2799 52.5007 11.6606 0.0089 5.7323 5.8115 0.4417 0.0797 0.8707 343.3305 6.6281 2.0555 1.7293 4.0248 34.7842 4.1720 37.3879 6.8970 0.0803 0.0174 0.2471 1.5805 2.3753 56.3869 825.6831 13.8410 6.0816 0.7270 92.0199 0.1478 0.2022 10.0241 2.9960 5.5293 20.4090 200.2799 4.9249 0.8926 4.7935 11.1162 698.5625 10.8514 40.8693 7.3458 0.0247 67.2822 10.5602 3.1339 12.4111 42.5181 22.0796 71.7535 44.7797 61.5356 40.1691
temp: 298.150 k
press: 1.00000 atm
elementType: 8 8 8 8 7 7 6 6 6 6 6 6 6 6 6 6 6 1 1 1 1 1 1 1 1 1 1 1 1 1 1
symmnumber: 1
zpe: 640074.5 jmol-1
zpe.correction: 0.243791 hartree
zpe.thermalcorrener: 0.261039 hartree
zpe.thermalcorrenthalpy: 0.261983 hartree
zpe.thermalcorrgfe: 0.193691 hartree
zpe.sumelectzpe: -836.729295 hartree
zpe.sumelectthermal: -836.712047 hartree
zpe.sumelectthermalent: -836.711103 hartree
zpe.sumelectthermalfe: -836.779395 hartree
dipole: -0.0092 3.3290 -3.8847
dipole: 5.1160
quadrupole: -83.5637 -103.3136 -95.3100
quadrupole: 0.0545 0.1534 5.3087
quadrupole: 10.4987 -9.2511 -1.2476 0.0545 0.1534 5.3087
hfenergy: -836.9730863 hartree
pointgroup: C01 [X(C11H14N2O4)]
dipole: 0.1083556 -1.2947336 1.5372716 debye
polarizability: 139.9941449|-0.8475544|149.745695|-1.3037621|-13.1426324|129.0365014 unknown
InChI: InChI=1S/C11H14N2O4/c12-10(14)16-6-9(7-17-11(13)15)8-4-2-1-3-5-8/h1-5,9H,6-7,12-13H2
charge 0 multiplicity 1
31 atoms
O  2.437275 0.874368 0.380108
O  -2.369468 0.866045 0.717017
O  3.755184 2.024357 -1.203321
O  -3.900063 2.003838 -0.672118
N  4.698084 0.66787 0.469703
N  -4.595166 0.653196 1.122253
C  0.021671 0.70711 0.369266
C  0.006412 -0.797988 0.094078
C  1.227927 1.413878 -0.279899
C  -1.26656 1.405655 -0.10906
C  -0.069219 -1.298823 -1.230726
C  0.065128 -1.722811 1.1641
C  -0.084702 -2.688808 -1.478617
C  0.049633 -3.115287 0.922491
C  -0.025283 -3.603978 -0.40175
C  3.657602 1.259208 -0.212243
C  -3.662085 1.244122 0.299141
H  0.096244 0.866136 1.461938
H  1.191811 2.507946 -0.117842
H  1.29353 1.229142 -1.367646
H  -1.213296 2.500985 0.039322
H  -1.482983 1.21232 -1.175556
H  -0.116585 -0.605134 -2.080239
H  0.123004 -1.347411 2.193003
H  -0.143025 -3.058125 -2.508786
H  0.095777 -3.81619 1.763939
H  -0.037213 -4.682925 -0.592969
H  4.513202 0.036564 1.245274
H  5.648244 0.84814 0.159364
H  -4.301996 0.026608 1.867678
H  -5.579883 0.829791 0.946799
