program: Orca
programVersion: 5.0.1
elementType: Cl Cl N N N C C C C C C C C C H H H H H H H H H H C N C H H H C N C H H H
charge: 1
multiplicity: 1
keywords: wB97X-D3 Opt Freq def2-TZVPP def2/J RIJCOSX TightSCF
keywords: PAL8 defgrid3 TightOpt
frequency: 0.00 0.00 0.00 0.00 0.00 0.00 -23.05 8.99 11.39 20.04 25.03 26.21 27.98 47.33 56.01 66.15 69.69 86.23 99.80 107.77 126.28 130.45 166.17 179.03 205.03 209.58 298.07 312.51 331.12 404.10 404.89 407.08 408.05 416.76 452.07 508.47 525.88 552.81 559.93 625.15 671.04 715.83 717.62 728.99 756.71 805.51 824.31 834.95 883.51 909.27 943.75 946.27 950.17 962.53 1036.13 1049.46 1062.87 1063.25 1063.45 1063.79 1068.76 1109.69 1137.08 1143.85 1160.28 1192.42 1241.67 1241.82 1261.56 1289.86 1299.04 1329.36 1354.57 1394.49 1416.47 1416.96 1470.83 1471.01 1472.74 1473.41 1476.10 1492.17 1503.11 1521.90 1540.59 1544.67 1650.02 1663.58 1678.34 1743.82 2413.33 2424.52 3080.21 3087.13 3088.03 3088.04 3154.96 3165.21 3175.84 3176.91 3177.07 3177.82 3216.86 3236.84 3241.57 3412.61 3532.77 3641.71
formula: C13H16Cl2N5
InChI: InChI=1S/C9H10Cl2N3.2C2H3N/c10-6-2-1-3-7(11)8(6)14-9-12-4-5-13-9;2*1-2-3/h1-3,12-14H,4-5H2;2*1H3
36 atoms
Cl 2.527167 1.010947 0.459418
Cl -1.789684 -2.183456 0.92706
N  -1.865296 1.749153 -0.680476
N  -0.384729 0.431509 0.557376
N  -0.90849 0.064033 -1.712685
C  -2.231587 1.949539 -2.079727
C  -1.852657 0.591585 -2.693936
C  -1.017823 0.722845 -0.572925
C  0.455588 -0.695766 0.720996
C  1.842552 -0.549876 0.712962
C  -0.080531 -1.967229 0.922529
C  2.674216 -1.637997 0.910808
C  0.743471 -3.062379 1.116555
C  2.116485 -2.888972 1.113499
H  -1.654483 2.766761 -2.516596
H  -3.291365 2.168966 -2.180726
H  -2.716497 -0.0695 -2.77921
H  -1.384446 0.690288 -3.66984
H  -1.904115 2.4577 0.03495
H  -0.468004 1.115242 1.301293
H  3.745776 -1.497777 0.908676
H  0.303746 -4.036402 1.277652
H  2.763087 -3.740622 1.279066
H  -0.385119 -0.801849 -1.841874
C  1.151262 -3.292478 -2.707224
N  0.571657 -2.361091 -2.379876
C  1.887417 -4.474404 -3.121645
H  1.257702 -5.096487 -3.755185
H  2.774695 -4.178513 -3.678478
H  2.187977 -5.045457 -2.244959
C  -1.107418 3.648678 2.982359
N  -1.114905 2.9233 2.095256
C  -1.098697 4.566733 4.107621
H  -0.079867 4.895727 4.304453
H  -1.717606 5.432513 3.878348
H  -1.493714 4.06728 4.99055
totalener: -1699.07577853 hartree
nucrepener: 1786.87182921 hartree
electener: -3485.94760774 hartree
oneelecener: -5860.41775216 hartree
twoeener: 2374.47014442 hartree
kineticenergy: 1694.33598329 hartree
temp: 298.15 k
press: 1.00 atm
thermalcorrenthalpy: 0.00094421 hartree
totalenthalpy: -1698.78615798 hartree
chargesum: 1.0000000
charge: -0.025773 -0.023149 -0.213078 -0.211912 -0.196251 -0.039776 -0.035928 0.377394 0.101188 -0.024337 -0.018439 -0.080780 -0.088429 -0.140718 0.109610 0.112299 0.105771 0.112717 0.194442 0.236157 0.137940 0.135988 0.149180 0.219496 -0.112284 -0.138146 -0.054298 0.126865 0.125495 0.115011 -0.075300 -0.204097 -0.052706 0.125821 0.123947 0.126080
charge: 0.448995 0.457831 0.354446 0.359664 0.370528 -0.007970 -0.002394 -0.275497 -0.194756 -0.383148 -0.386650 -0.021205 -0.024812 0.009386 0.020671 0.024336 0.022849 0.025499 -0.030173 -0.025195 0.031652 0.031105 0.033196 -0.069889 -0.119102 0.073503 0.032322 0.048020 0.047643 0.043982 -0.110596 0.032580 0.036456 0.048751 0.049021 0.048950
qa: -0.0258 -0.0231 -0.2131 -0.2119 -0.1963 -0.0398 -0.0359 0.3774 0.1012 -0.0243 -0.0184 -0.0808 -0.0884 -0.1407 0.1096 0.1123 0.1058 0.1127 0.1944 0.2362 0.1379 0.1360 0.1492 0.2195 -0.1123 -0.1381 -0.0543 0.1269 0.1255 0.1150 -0.0753 -0.2041 -0.0527 0.1258 0.1239 0.1261
va: 1.2982 1.3005 3.2542 3.2177 3.2641 3.9228 3.9118 4.1786 3.4984 4.1007 4.0415 3.9485 3.9338 3.9396 1.0016 1.0022 1.0040 1.0031 1.0288 1.0027 1.0081 1.0092 0.9938 1.0398 3.8536 3.1068 3.8523 1.0005 1.0000 1.0018 3.8309 3.0520 3.8497 0.9998 1.0009 0.9999
dispcorr: -0.017839749 hartree
energy: -1699.093693476084
dipole: -3.49885 3.20949 -0.28936 4.25325 -3.35341 0.89984 -7.52409 7.20469 -0.31940
magnitude: 0.99773 au
magnitude: 2.53602 debye
zeropoint: 0.28275952 hartree
thermalvibcorrection: 0.01997564 hartree
thermalrotcorrection: 0.00141627 hartree
thermaltrasncorrection: 0.00141627 hartree
thermaltotal: -1698.78812577 hartree
thermalcorr: 0.02280818 hartree
nonthermalcorr: 0.28275952 hartree
totalcorr: 0.30556771 hartree
totalenthalpy: -1698.78718156 hartree
