program: Orca
programVersion: 5.0.1
elementType: N C C C C C C H H H H H H H H C N C H H H C N C H H H C N C H H H C N C H H H
charge: 1
multiplicity: 1
keywords: wB97X-D3 Opt Freq def2-TZVPP def2/J RIJCOSX TightSCF
keywords: PAL8 defgrid3 TightOpt
frequency: 0.00 0.00 0.00 0.00 0.00 0.00 -23.12 -5.68 14.85 17.46 17.72 19.60 23.94 28.91 35.57 42.26 46.92 56.52 59.49 73.27 76.87 78.29 82.10 84.41 95.14 98.14 113.84 136.62 171.35 180.57 300.73 397.05 397.92 403.37 404.87 406.16 407.15 408.05 409.87 421.59 425.36 501.22 511.87 539.30 636.68 720.52 781.94 822.11 877.04 942.87 946.00 947.41 948.59 959.12 1023.85 1033.94 1049.27 1061.36 1063.32 1063.64 1063.78 1063.86 1064.04 1064.98 1065.79 1070.03 1112.66 1160.91 1193.09 1211.77 1220.47 1252.85 1345.88 1380.88 1407.13 1416.81 1416.96 1417.40 1467.26 1472.00 1472.02 1472.18 1472.23 1473.29 1476.06 1478.07 1521.82 1555.09 1612.33 1671.85 1689.65 1698.88 1717.50 2413.40 2420.73 2422.76 2425.98 3082.96 3085.23 3088.43 3088.49 3145.09 3166.56 3174.11 3176.91 3177.30 3177.42 3177.48 3177.53 3177.93 3183.40 3207.49 3213.66 3220.34 3227.91 3234.16 3258.95
formula: C14H20N5
InChI: InChI=1S/C6H8N.4C2H3N/c7-6-4-2-1-3-5-6;4*1-2-3/h1-5H,7H3;4*1H3
39 atoms
N  0.879021 0.082512 0.287041
C  0.126503 -0.58243 -0.771751
C  -0.744462 -1.604622 -0.441928
C  0.331664 -0.199227 -2.08587
C  -1.420893 -2.26288 -1.457831
C  -0.350179 -0.863881 -3.093687
C  -1.222598 -1.896704 -2.780929
H  -0.900974 -1.877547 0.593474
H  1.017517 0.605441 -2.319146
H  -2.104448 -3.064071 -1.210261
H  -0.194089 -0.576542 -4.124993
H  -1.748106 -2.417505 -3.570569
H  1.788957 -0.397023 0.423504
H  1.06211 1.070388 0.047706
H  0.363655 0.05836 1.188955
C  -1.566158 -0.033651 3.381249
N  -0.646916 -0.008549 2.698787
C  -2.739006 -0.066644 4.233493
H  -3.6193 -0.114839 3.593907
H  -2.700677 -0.941145 4.880463
H  -2.774756 0.832787 4.845487
C  4.221668 -2.126389 0.601684
N  3.31114 -1.438563 0.512991
C  5.376513 -2.999963 0.715197
H  5.115563 -3.99854 0.369224
H  6.1920 -2.611103 0.108025
H  5.695631 -3.051918 1.75463
C  1.545554 3.991156 -0.593659
N  1.341735 2.875982 -0.433143
C  1.805147 5.406236 -0.79489
H  2.542823 5.53533 -1.584914
H  0.883745 5.912419 -1.077208
H  2.186407 5.842624 0.126633
C  -3.730683 0.248482 -0.072041
N  -3.701193 -0.007773 1.044849
C  -3.760678 0.573495 -1.489286
H  -4.341098 -0.173708 -2.027378
H  -4.21608 1.551142 -1.636109
H  -2.745293 0.583402 -1.884337
totalener: -819.12322661 hartree
nucrepener: 1226.18772737 hartree
electener: -2045.31095397 hartree
oneelecener: -3526.88255859 hartree
twoeener: 1481.57160462 hartree
kineticenergy: 814.64199124 hartree
temp: 298.15 k
press: 1.00 atm
thermalcorrenthalpy: 0.00094421 hartree
totalenthalpy: -818.79338186 hartree
chargesum: 1.0000000
charge: 0.000748 0.182753 -0.236189 -0.189438 -0.080833 -0.090215 -0.150474 0.131183 0.127230 0.148519 0.145078 0.146791 0.227152 0.208380 0.202777 -0.074028 -0.174561 -0.063017 0.149214 0.118629 0.117728 -0.102176 -0.141950 -0.055434 0.123817 0.123445 0.124740 -0.101522 -0.153193 -0.052924 0.123641 0.122985 0.125175 -0.179576 -0.092750 -0.077378 0.126385 0.135537 0.103750
charge: 0.600302 -0.105114 0.006352 -0.003641 0.004636 -0.001102 -0.001682 0.032107 0.028401 0.031159 0.029353 0.029278 -0.028437 -0.022171 -0.031853 -0.108135 0.065903 0.031035 0.044519 0.044235 0.044609 -0.108708 0.075575 0.034858 0.047886 0.047744 0.048124 -0.111615 0.063305 0.034806 0.047876 0.047585 0.048509 -0.155340 0.043987 0.018210 0.044346 0.042492 0.040606
qa: 0.0007 0.1828 -0.2362 -0.1894 -0.0808 -0.0902 -0.1505 0.1312 0.1272 0.1485 0.1451 0.1468 0.2272 0.2084 0.2028 -0.0740 -0.1746 -0.0630 0.1492 0.1186 0.1177 -0.1022 -0.1420 -0.0554 0.1238 0.1234 0.1247 -0.1015 -0.1532 -0.0529 0.1236 0.1230 0.1252 -0.1796 -0.0928 -0.0774 0.1264 0.1355 0.1038
va: 3.5598 3.6153 4.0291 4.0450 3.9018 3.9392 3.9484 1.0228 1.0208 0.9971 0.9984 0.9970 1.0364 1.0563 1.0778 3.8261 3.0864 3.8333 1.0103 1.0023 1.0015 3.8586 3.1109 3.8555 1.0005 1.0006 1.0003 3.8590 3.1044 3.8550 1.0006 1.0006 1.0002 3.8898 3.0754 3.8533 0.9988 1.0035 1.0016
dispcorr: -0.015358936 hartree
energy: -819.149878652396
dipole: 1.95959 -0.13956 1.82004 2.98185 -1.92280 1.05905 -1.40242 1.21015 -0.19226
magnitude: 2.11449 au
magnitude: 5.37462 debye
zeropoint: 0.32046930 hartree
thermalvibcorrection: 0.02284610 hartree
thermalrotcorrection: 0.00141627 hartree
thermaltrasncorrection: 0.00141627 hartree
thermaltotal: -818.80373072 hartree
thermalcorr: 0.02567864 hartree
nonthermalcorr: 0.32046930 hartree
totalcorr: 0.34614794 hartree
totalenthalpy: -818.80278651 hartree
