program: Orca
programVersion: 5.0.1
elementType: N C C C C C C H H H H H H H H C H H H O H
charge: 1
multiplicity: 1
keywords: wB97X-D3 Opt Freq def2-TZVPP def2/J RIJCOSX TightSCF
keywords: PAL8 TightOpt defgrid3
frequency: 0.00 0.00 0.00 0.00 0.00 0.00 -21.26 35.86 52.65 59.75 82.54 130.61 139.99 324.90 337.52 360.86 402.43 518.95 572.59 603.12 633.72 641.10 817.25 824.00 848.03 909.22 911.01 990.90 1001.49 1030.46 1066.10 1074.38 1082.74 1095.14 1179.02 1181.87 1199.40 1222.98 1352.96 1366.98 1384.40 1423.42 1434.35 1491.62 1502.03 1517.20 1520.10 1567.07 1647.54 1705.03 1729.15 3047.38 3048.37 3062.64 3120.21 3148.68 3207.68 3208.24 3221.06 3223.57 3606.49 3722.02 3916.72
formula: C7H12NO
InChI: InChI=1S/C6H8N.CH4O/c7-6-4-2-1-3-5-6;1-2/h2-5H,1,7H2;2H,1H3
21 atoms
N  3.346877 0.939303 0.216632
C  2.181684 0.350911 0.077426
C  2.109226 -1.084976 0.043929
C  0.990051 1.14123 -0.040499
C  0.9208 -1.686454 -0.096497
C  -0.198207 0.535978 -0.180787
C  -0.338882 -0.930369 -0.220027
H  3.024071 -1.656925 0.133475
H  1.073137 2.220391 -0.014537
H  0.866177 -2.768207 -0.121398
H  -1.114313 1.10704 -0.275283
H  -1.049036 -1.246072 0.555546
H  3.427334 1.942572 0.243514
H  4.197426 0.407248 0.301017
H  -3.757597 0.283466 -1.345217
C  -4.154338 0.227215 0.56342
H  -4.739301 1.148673 0.587811
H  -3.556112 0.175969 1.471783
H  -4.830946 -0.629609 0.544087
O  -3.25214 0.207051 -0.536679
H  -0.86973 -1.215935 -1.137519
totalener: -403.73012031 hartree
nucrepener: 420.85239107 hartree
electener: -824.58251138 hartree
oneelecener: -1368.62484428 hartree
twoeener: 544.04233290 hartree
kineticenergy: 401.92438103 hartree
temp: 298.15 k
press: 1.00 atm
thermalcorrenthalpy: 0.00094421 hartree
totalenthalpy: -403.54181469 hartree
chargesum: 1.0000000
charge: -0.119489 0.257626 -0.122560 -0.132220 -0.084353 -0.097743 0.041090 0.135605 0.132793 0.164361 0.181352 0.111723 0.190688 0.189558 0.200906 -0.083607 0.116689 0.073263 0.117781 -0.389943 0.116478
charge: 0.462076 -0.060062 0.008149 0.004022 0.103359 0.108644 -0.003420 0.035421 0.034976 0.044961 0.036369 0.074760 0.012143 0.011743 -0.137929 -0.062230 0.001999 0.002722 0.001703 0.246042 0.074554
qa: -0.1195 0.2576 -0.1226 -0.1322 -0.0844 -0.0977 0.0411 0.1356 0.1328 0.1644 0.1814 0.1117 0.1907 0.1896 0.2009 -0.0836 0.1167 0.0733 0.1178 -0.3899 0.1165
va: 3.4946 3.8606 3.8970 3.9303 3.9899 3.9334 3.9858 1.0099 1.0121 0.9911 1.0242 1.0101 1.0042 1.0048 1.0270 3.8767 0.9897 0.9901 0.9879 1.9868 1.0156
dispcorr: -0.005742139 hartree
energy: -403.737140207930
dipole: -7.40617 9.14061 1.73444 -0.10719 0.31868 0.21149 1.13171 -1.13091 0.00080
magnitude: 1.74728 au
magnitude: 4.44125 debye
zeropoint: 0.18340508 hartree
thermalvibcorrection: 0.00753037 hartree
thermalrotcorrection: 0.00141627 hartree
thermaltrasncorrection: 0.00141627 hartree
thermaltotal: -403.54337221 hartree
thermalcorr: 0.01036291 hartree
nonthermalcorr: 0.18340508 hartree
totalcorr: 0.19376800 hartree
totalenthalpy: -403.54242800 hartree
