program: Orca
programVersion: 5.0.1
elementType: N C C C C C C H H H H H H H H C H H H O H
charge: 1
multiplicity: 1
keywords: wB97X-D3 Opt Freq def2-TZVPP def2/J RIJCOSX TightSCF
keywords: PAL8 TightOpt defgrid3
frequency: 0.00 0.00 0.00 0.00 0.00 0.00 11.89 36.29 52.98 67.51 117.42 202.96 268.28 335.26 337.62 400.85 418.32 487.90 534.74 633.50 711.26 772.55 807.89 864.02 952.17 1024.04 1030.56 1047.59 1056.20 1062.30 1068.26 1091.91 1128.89 1161.87 1182.44 1196.32 1209.69 1222.88 1347.26 1375.83 1382.83 1492.41 1500.24 1518.41 1522.41 1549.62 1581.01 1659.72 1677.11 1679.74 1717.12 2856.57 3073.06 3158.97 3176.94 3199.04 3207.80 3221.70 3232.18 3240.09 3493.23 3556.32 3908.57
formula: C7H12NO
InChI: InChI=1S/C6H8N.CH4O/c7-6-4-2-1-3-5-6;1-2/h1-5H,7H3;2H,1H3
21 atoms
N  -0.696006 -1.194605 0.633524
C  0.549758 -0.478754 0.301569
C  1.624452 -1.189975 -0.192922
C  0.590599 0.888056 0.504433
C  2.788543 -0.500157 -0.497009
C  1.761513 1.562784 0.198642
C  2.855872 0.870412 -0.300355
H  1.568451 -2.262059 -0.34223
H  -0.270932 1.419482 0.890088
H  3.64172 -1.038371 -0.886697
H  1.817061 2.632055 0.351005
H  3.766624 1.403364 -0.537929
H  -0.685989 -2.135651 0.246956
H  -0.815111 -1.278567 1.641858
H  -1.532641 -0.683265 0.238015
C  -4.121414 0.210599 -0.033723
H  -4.205511 -0.335783 0.902453
H  -4.713378 -0.293116 -0.797047
H  -4.486567 1.225762 0.115255
O  -2.732715 0.223864 -0.392961
H  -2.611935 0.718289 -1.204006
totalener: -403.74939980 hartree
nucrepener: 428.84863235 hartree
electener: -832.59803216 hartree
oneelecener: -1384.54550200 hartree
twoeener: 551.94746985 hartree
kineticenergy: 401.92607686 hartree
temp: 298.15 k
press: 1.00 atm
thermalcorrenthalpy: 0.00094421 hartree
totalenthalpy: -403.55826256 hartree
chargesum: 1.0000000
charge: 0.040529 0.148789 -0.174750 -0.221746 -0.073832 -0.067078 -0.124427 0.131922 0.142174 0.156142 0.156011 0.156776 0.186225 0.198970 0.219534 -0.083705 0.085236 0.131604 0.132350 -0.364058 0.223333
charge: 0.605511 -0.113602 -0.002317 -0.004389 0.025414 0.023774 0.027608 0.029047 0.029253 0.036687 0.036106 0.036816 0.050555 0.052055 -0.041744 -0.024169 0.009095 0.008497 0.010333 0.324414 -0.118944
qa: 0.0405 0.1488 -0.1747 -0.2217 -0.0738 -0.0671 -0.1244 0.1319 0.1422 0.1561 0.1560 0.1568 0.1862 0.1990 0.2195 -0.0837 0.0852 0.1316 0.1324 -0.3641 0.2233
va: 3.6516 3.6209 4.0736 4.0737 4.0101 3.9796 4.0070 1.0105 1.0202 0.9953 0.9950 0.9941 1.0045 0.9828 1.0893 3.8390 0.9933 0.9864 0.9874 2.0650 1.0076
dispcorr: -0.005900226 hartree
energy: -403.755938098933
dipole: -8.99200 7.35398 -1.63802 -0.82350 -0.17211 -0.99561 0.31112 -0.01581 0.29532
magnitude: 1.93947 au
magnitude: 4.92974 debye
zeropoint: 0.18641007 hartree
thermalvibcorrection: 0.00781296 hartree
thermalrotcorrection: 0.00141627 hartree
thermaltrasncorrection: 0.00141627 hartree
thermaltotal: -403.55888253 hartree
thermalcorr: 0.01064550 hartree
nonthermalcorr: 0.18641007 hartree
totalcorr: 0.19705557 hartree
totalenthalpy: -403.55793832 hartree
