program: Orca
programVersion: 5.0.1
elementType: Br N C C C C C C C C C H H H H H H H C H H H O H C H H H O H C H H H O H
charge: 1
multiplicity: 1
keywords: wB97X-D3 Opt Freq def2-TZVPP def2/J RIJCOSX TightSCF
keywords: PAL8 TightOpt defgrid3
frequency: 0.00 0.00 0.00 0.00 0.00 0.00 -34.59 10.38 16.86 22.35 27.20 40.38 48.09 51.03 52.87 68.11 79.80 83.95 90.74 94.95 99.57 115.40 122.62 162.29 199.05 205.71 268.73 269.13 287.23 345.97 399.13 415.16 423.50 497.60 508.47 536.19 603.43 644.20 654.93 720.11 789.39 802.65 813.52 879.02 912.53 958.79 977.36 1029.10 1053.93 1054.43 1059.37 1065.38 1073.24 1086.03 1087.72 1091.57 1093.59 1139.75 1151.71 1178.11 1182.16 1184.49 1185.89 1186.57 1246.81 1272.78 1311.83 1365.16 1373.88 1379.16 1406.98 1424.41 1437.06 1457.20 1489.96 1490.17 1492.40 1501.83 1502.99 1504.54 1507.02 1516.98 1518.35 1521.54 1555.79 1643.81 1665.92 1692.96 1736.47 3016.24 3048.90 3058.31 3061.88 3120.28 3130.86 3140.35 3156.10 3159.47 3169.69 3169.87 3207.13 3213.24 3217.84 3227.46 3236.40 3635.04 3909.02 3916.83
formula: C12H19BrNO3
InChI: InChI=1S/C9H7BrN.3CH4O/c10-8-5-7-3-1-2-4-9(7)11-6-8;3*1-2/h1-6,11H;3*2H,1H3
36 atoms
Br -0.612678 -2.833767 -0.016053
N  1.003298 0.894453 -0.056622
C  -1.338912 1.259299 0.135036
C  -0.030964 1.777387 0.045464
C  -2.422382 2.165201 0.240676
C  -1.521214 -0.13782 0.116322
C  0.203887 3.162328 0.060395
C  -2.183634 3.507709 0.254157
C  -0.865141 4.006402 0.163764
C  -0.433928 -0.969071 0.012832
C  0.841566 -0.414494 -0.074056
H  -2.532384 -0.530132 0.186259
H  -3.425219 1.762218 0.309514
H  1.215883 3.539331 -0.008714
H  -3.007507 4.203808 0.334681
H  -0.70112 5.075814 0.176876
H  1.743394 -1.010015 -0.158538
H  1.984988 1.244506 -0.128922
C  4.608961 2.373769 -0.365413
H  4.095287 3.332766 -0.380196
H  5.18071 2.273165 -1.289015
H  5.288002 2.354276 0.488471
O  3.624512 1.354656 -0.259313
H  4.017994 0.471454 -0.345177
C  4.745226 -1.988575 0.734964
H  4.495228 -1.413349 1.62339
H  5.830028 -2.025607 0.631122
H  4.351393 -2.999774 0.842522
O  4.141456 -1.32089 -0.37605
H  4.390977 -1.765433 -1.186398
C  -5.539989 -0.74849 -0.678835
H  -5.015855 -0.51294 -1.603013
H  -6.464731 -0.169049 -0.645396
H  -5.779791 -1.813598 -0.675346
O  -4.670169 -0.404271 0.39334
H  -5.094335 -0.627503 1.221198
totalener: -3323.21081825 hartree
nucrepener: 1534.79631214 hartree
electener: -4858.00713039 hartree
oneelecener: -7633.02816999 hartree
twoeener: 2775.02103960 hartree
kineticenergy: 3316.42653137 hartree
temp: 298.15 k
press: 1.00 atm
thermalcorrenthalpy: 0.00094421 hartree
totalenthalpy: -3322.90732388 hartree
chargesum: 1.0000000
charge: 0.069856 -0.085429 -0.096300 0.160907 -0.059255 0.001434 -0.184368 -0.121055 -0.037849 -0.076819 0.102659 0.179299 0.150431 0.128608 0.151853 0.152990 0.150599 0.228263 -0.087482 0.083894 0.113060 0.113604 -0.407572 0.241142 -0.098024 0.098481 0.129095 0.123479 -0.390679 0.214916 -0.088203 0.085882 0.115967 0.116376 -0.380270 0.200509
charge: 0.436205 0.447709 -0.051388 -0.075458 0.045315 0.071956 0.014090 0.021965 0.037781 -0.373078 -0.002245 0.032177 0.032945 0.030792 0.035188 0.037456 0.029918 -0.055219 -0.053785 0.005134 0.003780 0.003040 0.307433 -0.188123 -0.044803 0.010113 0.006013 0.005019 0.295537 -0.130299 -0.060843 0.006296 0.001377 0.000997 0.255753 -0.138749
qa: 0.0699 -0.0854 -0.0963 0.1609 -0.0593 0.0014 -0.1844 -0.1211 -0.0378 -0.0768 0.1027 0.1793 0.1504 0.1286 0.1519 0.1530 0.1506 0.2283 -0.0875 0.0839 0.1131 0.1136 -0.4076 0.2411 -0.0980 0.0985 0.1291 0.1235 -0.3907 0.2149 -0.0882 0.0859 0.1160 0.1164 -0.3803 0.2005
va: 1.2988 3.5319 4.0233 3.8605 3.8743 3.7341 4.0271 4.0022 3.9803 4.1760 3.8000 1.0424 1.0467 1.0188 0.9987 0.9946 1.0391 1.0627 3.8818 0.9950 0.9873 0.9837 1.9989 1.0439 3.8335 0.9923 0.9911 0.9897 2.0204 1.0158 3.8645 0.9913 0.9902 0.9905 2.0116 1.0279
dispcorr: -0.014073625 hartree
energy: -3323.226826987281
dipole: 16.27838 -15.08236 1.19603 38.12993 -37.00141 1.12851 -0.45754 0.42169 -0.03585
magnitude: 1.64478 au
magnitude: 4.18070 debye
zeropoint: 0.30074617 hartree
thermalvibcorrection: 0.01944472 hartree
thermalrotcorrection: 0.00141627 hartree
thermaltrasncorrection: 0.00141627 hartree
thermaltotal: -3322.90380355 hartree
thermalcorr: 0.02227726 hartree
nonthermalcorr: 0.30074617 hartree
totalcorr: 0.32302344 hartree
totalenthalpy: -3322.90285934 hartree
