program: Orca
programVersion: 5.0.1
elementType: Br N C C C C C C C C C H H H H H H H C H H H O H
charge: 1
multiplicity: 1
keywords: wB97X-D3 Opt Freq def2-TZVPP def2/J RIJCOSX TightSCF
keywords: PAL8 TightOpt defgrid3
frequency: 0.00 0.00 0.00 0.00 0.00 0.00 27.36 41.55 50.24 73.78 87.57 111.39 165.65 195.04 221.29 267.92 287.09 330.29 414.96 415.86 492.58 505.09 533.19 603.44 637.00 655.58 790.47 798.01 808.63 879.07 909.79 951.71 979.97 998.44 1029.66 1050.82 1054.00 1059.59 1080.37 1144.81 1157.22 1179.49 1182.88 1185.66 1246.08 1257.52 1307.87 1353.03 1383.37 1400.79 1418.95 1450.23 1492.97 1501.50 1504.98 1518.96 1546.34 1630.43 1656.96 1689.11 1725.38 3066.43 3115.19 3150.95 3172.96 3215.55 3218.33 3219.98 3229.49 3238.87 3242.73 3912.64
formula: C10H11BrNO
InChI: InChI=1S/C9H7BrN.CH4O/c10-8-5-7-3-1-2-4-9(7)11-6-8;1-2/h1-6,11H;2H,1H3
24 atoms
Br -3.216036 -0.422267 0.037574
N  0.829883 -0.712438 -0.207153
C  0.411341 1.615856 0.05197
C  1.327187 0.554667 -0.104763
C  0.918816 2.933236 0.158365
C  -0.963581 1.318662 0.095006
C  2.711713 0.787533 -0.154813
C  2.263303 3.151172 0.108417
C  3.162186 2.072585 -0.048852
C  -1.401288 0.021342 -0.013781
C  -0.458688 -0.993727 -0.167576
H  -1.678162 2.123874 0.214892
H  0.225443 3.755374 0.278757
H  3.392883 -0.044787 -0.275989
H  2.652126 4.157093 0.189323
H  4.225144 2.270715 -0.085787
H  -0.735038 -2.035197 -0.259833
H  1.498623 -1.499332 -0.323715
C  3.013775 -3.632137 0.600263
H  2.663669 -3.176566 1.523538
H  4.102683 -3.670737 0.614828
H  2.606956 -4.640242 0.523713
O  2.548689 -2.810433 -0.476129
H  2.835031 -3.17808 -1.312182
totalener: -3091.69978363 hartree
nucrepener: 1009.64618948 hartree
electener: -4101.34597311 hartree
oneelecener: -6271.68489154 hartree
twoeener: 2170.33891842 hartree
kineticenergy: 3085.81528655 hartree
temp: 298.15 k
press: 1.00 atm
thermalcorrenthalpy: 0.00094421 hartree
totalenthalpy: -3091.50254321 hartree
chargesum: 1.0000000
charge: 0.095872 -0.092571 -0.086409 0.158499 -0.043334 0.050429 -0.169659 -0.108688 -0.042376 -0.108258 0.120704 0.143462 0.140130 0.130591 0.158186 0.158076 0.156514 0.231783 -0.094673 0.089956 0.130374 0.134004 -0.368276 0.215664
charge: 0.461989 0.448440 -0.052733 -0.072021 0.044441 0.069974 0.016719 0.031412 0.044332 -0.371392 0.003555 0.050980 0.039128 0.031012 0.038748 0.040051 0.043199 -0.046495 -0.033035 0.009544 0.007836 0.007551 0.310341 -0.123574
qa: 0.0959 -0.0926 -0.0864 0.1585 -0.0433 0.0504 -0.1697 -0.1087 -0.0424 -0.1083 0.1207 0.1435 0.1401 0.1306 0.1582 0.1581 0.1565 0.2318 -0.0947 0.0900 0.1304 0.1340 -0.3683 0.2157
va: 1.3089 3.5187 4.0092 3.8587 3.9233 3.8313 4.0089 3.9912 3.9920 4.1861 3.8589 1.0033 1.0082 1.0390 0.9950 0.9944 1.0038 1.0532 3.8375 0.9918 0.9890 0.9895 2.0441 1.0153
dispcorr: -0.008651054 hartree
energy: -3091.709212858358
dipole: 50.56715 -47.80934 2.75782 -1.69276 1.11406 -0.57869 0.66380 -0.87507 -0.21127
magnitude: 2.82579 au
magnitude: 7.18258 debye
zeropoint: 0.19415701 hartree
thermalvibcorrection: 0.01031421 hartree
thermalrotcorrection: 0.00141627 hartree
thermaltrasncorrection: 0.00141627 hartree
thermaltotal: -3091.50190910 hartree
thermalcorr: 0.01314675 hartree
nonthermalcorr: 0.19415701 hartree
totalcorr: 0.20730376 hartree
totalenthalpy: -3091.50096489 hartree
