program: Orca
programVersion: 5.0.1
elementType: N C C C C C C C C C C H H H H H H H H H H H H H H H H
charge: 1
multiplicity: 1
keywords: wB97X-D3 Opt Freq def2-TZVPP def2/J RIJCOSX TightSCF
keywords: PAL8 TightOpt defgrid3
frequency: 0.00 0.00 0.00 0.00 0.00 0.00 29.71 59.60 71.14 93.14 209.36 219.11 243.88 263.76 345.22 372.36 390.51 419.21 462.14 513.54 610.27 638.93 729.35 766.76 809.61 824.09 869.57 880.45 895.36 930.62 962.73 1023.77 1031.00 1036.02 1038.66 1051.75 1067.58 1089.48 1096.62 1127.91 1160.41 1191.55 1215.41 1217.71 1242.60 1268.78 1337.96 1340.43 1364.29 1373.86 1382.31 1417.06 1437.22 1439.47 1473.20 1483.03 1502.02 1503.66 1508.93 1511.25 1513.20 1553.60 1659.57 1672.10 1689.77 3054.52 3059.88 3100.90 3105.03 3116.30 3136.26 3172.62 3177.35 3189.49 3200.96 3212.07 3217.89 3221.67 3232.54 3471.97 3525.78
formula: C10H16N
InChI: InChI=1S/C10H16N/c1-9(11-2)8-10-6-4-3-5-7-10/h3-7,9H,8,11H2,1-2H3
27 atoms
N  3.033837 0.198569 0.02316
C  1.561767 0.257611 0.407738
C  0.700362 -0.065737 -0.8124
C  -0.764044 -0.125391 -0.449588
C  1.292774 1.624873 1.004917
C  -1.267643 -1.228236 0.232879
C  -1.619752 0.921002 -0.771022
C  3.58673 -1.152159 -0.274697
C  -2.603222 -1.279216 0.597498
C  -2.957708 0.870297 -0.409208
C  -3.449996 -0.227709 0.278421
H  1.440613 -0.517331 1.166954
H  0.998734 -1.024252 -1.241333
H  0.86027 0.699897 -1.578054
H  0.256893 1.672538 1.33368
H  1.44168 2.419168 0.269942
H  1.923338 1.821215 1.873828
H  3.56913 0.613261 0.784556
H  -0.618254 -2.064517 0.470705
H  -1.244608 1.779557 -1.31659
H  4.654107 -1.062972 -0.459269
H  3.095003 -1.557438 -1.152599
H  3.409457 -1.794696 0.583544
H  -2.985687 -2.144285 1.123091
H  -3.616488 1.688076 -0.670134
H  -4.494297 -0.26895 0.558228
H  3.17599 0.810987 -0.780255
totalener: -445.26028008 hartree
nucrepener: 608.80663059 hartree
electener: -1054.06691067 hartree
oneelecener: -1793.90286605 hartree
twoeener: 739.83595539 hartree
kineticenergy: 443.10040484 hartree
temp: 298.15 k
press: 1.00 atm
thermalcorrenthalpy: 0.00094421 hartree
totalenthalpy: -445.00994139 hartree
chargesum: 1.0000000
charge: 0.104710 0.013047 -0.155392 0.032993 -0.270625 -0.190202 -0.184661 -0.173054 -0.120952 -0.103753 -0.115069 0.125367 0.132822 0.114288 0.132854 0.103648 0.102815 0.177231 0.118185 0.119444 0.148972 0.140737 0.140968 0.144150 0.145583 0.147682 0.168214
charge: 0.530511 -0.066057 -0.008408 -0.091605 0.033670 -0.009524 -0.006164 0.082146 0.005153 0.005395 0.008166 0.039697 0.032270 0.037093 0.042587 0.025634 0.021175 0.048888 0.021708 0.023741 0.028543 0.025907 0.030656 0.028965 0.029405 0.029752 0.050694
qa: 0.1047 0.0130 -0.1554 0.0330 -0.2706 -0.1902 -0.1847 -0.1731 -0.1210 -0.1038 -0.1151 0.1254 0.1328 0.1143 0.1329 0.1036 0.1028 0.1772 0.1182 0.1194 0.1490 0.1407 0.1410 0.1441 0.1456 0.1477 0.1682
va: 3.6792 3.7748 3.8382 3.5750 3.9841 4.0144 3.9983 3.8491 4.0051 3.9779 3.9768 0.9993 1.0152 1.0137 1.0018 1.0013 1.0106 0.9924 1.0075 1.0109 0.9918 0.9963 0.9939 0.9978 0.9967 0.9960 1.0055
dispcorr: -0.009874018 hartree
energy: -445.270177162647
dipole: 12.33373 -7.95907 4.37466 1.10515 -0.90329 0.20187 1.01155 -0.86325 0.14830
magnitude: 4.38183 au
magnitude: 11.13772 debye
zeropoint: 0.24792802 hartree
thermalvibcorrection: 0.00841665 hartree
thermalrotcorrection: 0.00141627 hartree
thermaltrasncorrection: 0.00141627 hartree
thermaltotal: -445.01099996 hartree
thermalcorr: 0.01124919 hartree
nonthermalcorr: 0.24792802 hartree
totalcorr: 0.25917720 hartree
totalenthalpy: -445.01005575 hartree
