program: Gaussian 09
title: 000031604
version: EM64L-G09RevD.01
frameworkgroup: C1[X(C11H10N2O6)]
method: RPBEPBE
basis: SDD
operation: Freq
keyword: #p
keyword: freq=noraman
keyword: PBEPBE/SDD
title: #p freq=noraman PBEPBE/SDD
converged: YES YES NO NO
title: Mulliken charges:
elementType: O O O O O O N N C C C C C C C C C C C H H H H H H H H H H
charge: -0.203401 -0.187884 -0.275710 -0.221134 -0.207415 -0.182039 -0.046163 0.051339 -0.068757 0.191753 0.268528 0.164101 -0.301235 0.194838 -0.741652 0.277521 -0.306564 -0.219703 -0.672864 0.290133 0.240396 0.259456 0.246336 0.297833 0.232220 0.241652 0.219611 0.233169 0.225633
chargesum: 0.00000
title: Mulliken charges with hydrogens summed into heavy atoms:
elementType: O O O O O O N N C C C C C C C C C C C
charge: -0.203401 -0.187884 -0.275710 -0.221134 -0.207415 -0.182039 -0.046163 0.051339 -0.068757 0.191753 0.268528 0.164101 -0.011102 0.194838 0.004536 0.277521 -0.008730 0.254169 0.005548
polarizability: 2.68077468e+02 1.73320820e+01 1.84035210e+02 8.76759831e+00 -5.18781677e+00 8.29662845e+01
1716.lowfreq: -5.4162 -3.0024 0.0007 0.0007 0.0010 1.3733 18.6975 26.0515 49.7835
frequency: 18.6947 26.0169 49.7818 55.4705 74.7652 84.6864 100.0320 110.0689 134.4415 150.5257 175.7268 211.1387 221.6040 249.5560 269.8181 283.4085 297.8422 322.0178 360.8078 377.5220 421.5812 458.5551 522.1893 550.7697 565.2919 599.0700 629.5735 668.3133 684.1940 690.3834 737.1175 758.2290 775.7630 798.9798 813.4927 824.9002 831.2287 875.4530 908.2082 918.5923 965.2949 1005.7558 1018.7507 1022.8841 1040.2813 1047.7907 1093.6311 1112.5508 1135.7201 1135.9970 1188.8902 1202.5376 1248.1545 1250.3913 1295.1097 1344.3128 1355.7253 1364.6139 1384.4779 1401.3793 1404.5762 1423.9785 1454.7230 1456.2452 1464.7135 1473.8057 1485.0537 1488.0161 1525.1899 1624.4956 1637.1353 2996.8556 3006.7233 3014.0903 3073.1524 3093.7689 3095.3295 3108.1366 3120.6451 3239.7568 3262.0129
redmass: 4.9341 5.9070 5.4375 4.5148 6.1582 4.4289 4.7120 2.8690 1.3115 2.8982 7.6052 2.9761 5.1130 1.6712 5.3341 4.8483 5.2551 4.3004 6.9540 3.6834 8.8837 9.6202 7.6554 6.5525 5.4355 7.3114 6.1181 6.2537 8.1531 6.9790 12.7339 7.4128 8.7581 1.1091 5.6510 1.3439 6.1274 8.3101 1.4071 7.5343 6.0641 1.7118 1.8356 1.6266 5.0024 1.5717 6.5757 2.2793 1.5467 4.2383 6.3908 2.1488 7.0865 1.1364 7.0570 4.6932 1.5547 6.7906 3.5174 1.2705 1.2994 6.3629 1.0473 2.0880 1.0544 1.0707 1.2763 1.6340 6.1732 11.8995 10.6681 1.0358 1.0362 1.0584 1.1063 1.0986 1.0974 1.1030 1.1011 1.0962 1.1040
irintensity: 2.9851 1.6668 0.5385 0.7502 0.6790 4.3182 1.0544 0.6547 2.8281 2.5057 1.8299 3.7009 2.5661 0.7464 0.9899 3.4076 0.4221 15.5472 4.2806 2.4623 0.1433 1.4701 1.5677 2.5829 0.9339 2.6734 2.3030 1.1584 8.9050 4.7283 19.8131 9.5932 7.3570 3.1644 0.7011 64.0420 2.7117 20.9228 0.9334 9.4387 9.6240 2.8086 13.1573 92.2222 280.6975 18.9909 13.4961 5.6120 3.3980 55.5526 298.0251 7.4747 294.5739 0.8192 50.8651 76.6834 3.1477 64.2647 21.9174 23.6165 32.7919 18.9726 18.2137 120.4736 11.5607 2.2189 63.6589 49.1281 39.9022 129.0310 48.4546 19.5508 8.8795 13.2341 3.5566 26.2822 7.5603 40.7354 8.5341 0.7293 7.5956
temp: 298.150 k
press: 1.00000 atm
elementType: 8 8 8 8 8 8 7 7 6 6 6 6 6 6 6 6 6 6 6 1 1 1 1 1 1 1 1 1 1
symmnumber: 1
zpe: 530355.2 jmol-1
zpe.correction: 0.202002 hartree
zpe.thermalcorrener: 0.220145 hartree
zpe.thermalcorrenthalpy: 0.221089 hartree
zpe.thermalcorrgfe: 0.152971 hartree
zpe.sumelectzpe: -984.475474 hartree
zpe.sumelectthermal: -984.457331 hartree
zpe.sumelectthermalent: -984.456386 hartree
zpe.sumelectthermalfe: -984.524505 hartree
dipole: -4.4191 -1.5880 0.7594
dipole: 4.7568
quadrupole: -101.9902 -115.6298 -109.5665
quadrupole: -26.0240 2.0684 -2.7829
quadrupole: 7.0719 -6.5676 -0.5043 -26.0240 2.0684 -2.7829
hfenergy: -984.6774754 hartree
pointgroup: C01 [X(C11H10N2O6)]
dipole: -1.7891241 -0.4461485 0.3198833 debye
polarizability: 270.7583001|8.8958102|181.2186047|6.6797279|-7.8282223|83.1020577 unknown
InChI: InChI=1S/C11H10N2O6/c1-3-17-11(14)9-6(2)12-19-10(9)7-4-5-8(18-7)13(15)16/h4-5H,3H2,1-2H3
charge 0 multiplicity 1
29 atoms
O  -0.714577 -2.698455 -0.180415
O  1.653139 0.066778 -0.192551
O  -2.5931 1.513068 -0.036061
O  -0.563834 1.48306 1.119066
O  5.131078 0.916229 -0.140551
O  3.293753 2.16964 -0.730626
N  -2.184358 -2.717903 -0.280413
N  3.855798 1.082469 -0.324044
C  -1.430102 -0.549523 0.100312
C  -0.306912 -1.380117 0.050698
C  1.120215 -1.19364 0.133096
C  -2.564563 -1.427487 -0.124438
C  2.154823 -2.081794 0.453875
C  -1.442838 0.888826 0.452627
C  -4.028704 -1.100213 -0.174314
C  3.033841 -0.066515 -0.048287
C  3.383308 -1.355751 0.34429
C  -2.710498 2.976377 0.271935
C  -3.994579 3.464793 -0.38836
H  2.025158 -3.122918 0.740008
H  -4.354441 -0.617288 0.763113
H  -4.235425 -0.389393 -0.991206
H  -4.612908 -2.021319 -0.329154
H  4.393611 -1.711539 0.526108
H  -2.721615 3.095913 1.37042
H  -1.809418 3.480717 -0.120057
H  -4.124133 4.544464 -0.191523
H  -3.959192 3.315018 -1.480831
H  -4.875328 2.933101 0.011084
