program: Gaussian 09
title: 000003329
version: EM64L-G09RevD.01
frameworkgroup: C1[X(C12H15NO5S)]
method: RPBEPBE
basis: SDD
operation: Freq
keyword: #p
keyword: freq=noraman
keyword: PBEPBE/SDD
title: #p freq=noraman PBEPBE/SDD
converged: YES YES NO NO
title: Mulliken charges:
elementType: S O O O O O N C C C C C C C C C C C C H H H H H H H H H H H H H H H
charge: 0.296580 -0.278350 -0.453614 -0.179534 -0.405679 -0.268349 -0.153400 -0.511626 -0.188202 0.084858 -0.236549 -0.040436 0.335580 -0.094515 -0.477792 -0.464485 -0.296325 -0.688158 0.102288 0.300042 0.302187 0.200977 0.270980 0.230864 0.276745 0.235457 0.237513 0.225820 0.206043 0.227743 0.244451 0.206082 0.365974 0.386830
chargesum: 0.00000
title: Mulliken charges with hydrogens summed into heavy atoms:
elementType: S O O O O O N C C C C C C C C C C C C
charge: 0.296580 -0.278350 -0.087640 -0.179534 -0.018849 -0.268349 -0.153400 -0.211584 0.113985 0.084858 -0.236549 0.160541 0.335580 0.176465 0.029818 0.008485 0.135538 -0.009882 0.102288
polarizability: 2.21016060e+02 -5.66686384e+00 1.87718585e+02 -1.11285895e+00 5.13498826e+00 1.14460834e+02
1716.lowfreq: -12.9225 -0.0020 -0.0017 -0.0013 3.0882 10.3690 39.7379 41.0114 55.3108
frequency: 39.6665 40.9927 55.2582 59.8277 68.9424 83.8209 95.9956 118.5286 128.2553 143.7602 166.8480 197.1727 213.9089 220.5738 244.6611 277.5398 310.5303 346.9222 348.1959 388.2954 426.2550 427.7134 442.4220 482.7365 504.9301 541.4234 553.0445 591.3576 601.2850 625.6155 652.4760 685.1365 705.7128 727.6789 771.8409 788.0756 845.0067 858.5659 866.3564 886.2096 900.7434 905.6626 924.6584 953.2803 1011.0015 1018.6844 1028.2403 1036.7701 1051.5793 1063.5815 1075.4252 1080.4980 1102.8034 1124.2642 1134.2970 1159.5685 1165.9172 1190.2373 1204.3452 1213.8549 1222.7138 1245.5116 1252.7460 1263.3375 1267.4529 1288.9960 1314.5792 1324.2954 1331.0412 1334.8286 1366.5961 1381.0176 1397.2012 1457.9345 1465.9065 1471.6698 1477.2317 1492.6073 1557.9945 1606.1589 1716.0594 2937.7555 2987.4528 2991.0875 2995.2475 3018.1633 3020.8966 3060.0384 3070.6397 3071.9692 3089.1702 3090.0416 3102.9096 3115.0473 3510.4983 3527.9743
redmass: 4.5328 5.3378 4.2113 4.3972 4.3871 6.1601 4.9127 6.4943 6.8287 8.0430 4.8127 1.9793 1.6412 2.8972 3.0626 6.8215 4.5534 10.2983 5.7189 6.8895 2.4428 6.7025 1.3133 3.9807 3.6815 4.1116 1.8053 2.9574 2.3859 3.3927 5.2848 5.9042 6.6500 9.4086 7.3490 7.5029 2.9336 2.1520 2.3247 2.8563 1.8001 2.1356 2.6032 4.1223 3.6828 4.8565 3.4467 2.1224 3.9151 1.9040 2.5997 2.1092 1.9159 1.8793 1.3202 1.4992 1.4045 1.8285 1.4287 1.3297 1.7855 1.2711 1.4910 1.2627 1.8201 1.4398 1.3145 1.3638 1.3599 1.3048 4.2529 1.4252 1.4788 1.0507 1.0837 1.0953 1.0470 1.0915 10.3263 8.1631 12.6582 1.0848 1.0645 1.0362 1.0828 1.0637 1.0637 1.0858 1.1007 1.0898 1.0994 1.1041 1.1000 1.1020 1.0664 1.0643
irintensity: 1.2484 0.9823 0.9986 0.7964 1.7874 2.8646 0.9541 7.4248 6.6948 0.6569 11.2650 1.4777 3.1143 0.7468 1.7870 5.7585 2.5543 3.4669 7.7637 1.0516 45.4468 5.7117 152.4199 6.4241 23.7251 13.5669 28.8478 58.1802 82.1483 13.7407 25.6065 15.7099 6.7026 12.7085 5.7278 19.5090 17.8119 8.1623 18.3072 21.3154 5.4357 25.0543 12.5504 29.0219 30.4236 148.9748 169.9406 32.1978 101.9106 28.6981 117.0503 14.2626 5.9924 36.8414 2.5762 61.6293 10.9988 21.1380 3.1654 6.4002 7.3438 19.3560 44.4150 33.5446 72.0761 31.6643 2.6672 19.7640 3.0145 1.6543 212.3557 8.2478 52.5578 7.3392 8.4527 11.3316 8.4740 2.5215 159.1901 267.9956 444.0021 45.1309 77.1446 14.0378 2.4846 24.4095 14.7601 0.5739 38.7746 17.5348 29.0459 34.0211 26.1732 12.3064 9.4228 65.7758
temp: 298.150 k
press: 1.00000 atm
elementType: 16 8 8 8 8 8 7 6 6 6 6 6 6 6 6 6 6 6 6 1 1 1 1 1 1 1 1 1 1 1 1 1 1 1
symmnumber: 1
zpe: 680099.3 jmol-1
zpe.correction: 0.259036 hartree
zpe.thermalcorrener: 0.278022 hartree
zpe.thermalcorrenthalpy: 0.278966 hartree
zpe.thermalcorrgfe: 0.210507 hartree
zpe.sumelectzpe: -1293.726244 hartree
zpe.sumelectthermal: -1293.707258 hartree
zpe.sumelectthermalent: -1293.706314 hartree
zpe.sumelectthermalfe: -1293.774773 hartree
dipole: 2.4029 -1.6005 -0.4373
dipole: 2.9201
quadrupole: -120.8081 -116.0874 -120.2771
quadrupole: 0.2817 15.8259 -5.2405
quadrupole: -1.7506 2.9701 -1.2195 0.2817 15.8259 -5.2405
hfenergy: -1293.9852805 hartree
pointgroup: C01 [X(C12H15N1O5S1)]
dipole: 0.9666237 -0.5940689 -0.1804855 debye
polarizability: 221.3673427|-4.4363692|187.2614789|-1.6872171|5.7511456|114.5666585 unknown
InChI: InChI=1S/C12H15NO5S/c1-5(14)7-10(15)13-8(12(16)17)9(19-11(7)13)6-3-2-4-18-6/h5-7,11,14,16H,2-4H2,1H3
charge 0 multiplicity 1
34 atoms
S  0.319981 -1.83449 -0.435477
O  3.204972 -1.585402 -0.73412
O  -4.812908 -0.613633 1.001026
O  -2.361556 1.494689 1.40769
O  -0.205595 3.168454 -0.676719
O  2.044526 2.64344 -0.36145
N  -1.015129 0.533862 -0.415227
C  -1.337221 -0.879159 -0.745912
C  -2.474355 -0.862447 0.324539
C  -2.004369 0.597396 0.625456
C  1.198329 -0.234673 -0.41125
C  -3.946226 -0.992193 -0.126312
C  0.37502 0.879982 -0.448584
C  2.697826 -0.25659 -0.305838
C  3.230536 -0.042613 1.141317
C  4.578811 -0.800878 1.100203
C  4.239441 -2.037432 0.242032
C  -4.33539 -2.421272 -0.511833
C  0.845511 2.266501 -0.483732
H  -1.621977 -1.066604 -1.792288
H  -2.286874 -1.529131 1.18326
H  -4.117375 -0.306665 -0.986758
H  3.114989 0.528108 -0.966896
H  2.543517 -0.50588 1.872796
H  3.326843 1.029767 1.367572
H  5.349658 -0.183566 0.604922
H  4.942219 -1.073776 2.105355
H  5.093017 -2.425058 -0.339054
H  3.809262 -2.854728 0.853505
H  -4.172293 -3.10517 0.339534
H  -5.404638 -2.455991 -0.780422
H  -3.74514 -2.776832 -1.375964
H  -4.539348 0.280358 1.340263
H  0.159335 4.093827 -0.653731
