program: Gaussian 09
title: 000031560
version: EM64L-G09RevD.01
frameworkgroup: C1[X(C7H18N2S2)]
method: RPBEPBE
basis: SDD
operation: Freq
keyword: #p
keyword: freq=noraman
keyword: PBEPBE/SDD
title: #p freq=noraman PBEPBE/SDD
converged: YES YES NO NO
title: Mulliken charges:
elementType: S S N N C C C C C C C H H H H H H H H H H H H H H H H H H
charge: 0.190738 0.199739 -0.586678 -0.552805 -0.424181 -0.611327 -0.611328 -0.593499 -0.622414 -0.368290 -0.370561 0.254410 0.220192 0.221958 0.216007 0.226026 0.254564 0.245712 0.257179 0.247287 0.232146 0.224761 0.205418 0.227507 0.225027 0.268436 0.283781 0.269254 0.270940
chargesum: 0.00000
title: Mulliken charges with hydrogens summed into heavy atoms:
elementType: S S N N C C C C C C C
charge: 0.190738 0.199739 -0.034461 -0.012611 -0.424181 0.085233 0.085269 -0.090609 -0.142981 0.061889 0.081973
polarizability: 2.03033012e+02 -5.18027133e-01 1.07695833e+02 -2.08726908e+00 -1.07429471e+00 9.53209315e+01
1716.lowfreq: -8.3792 -0.0016 0.0017 0.0024 6.7331 11.7265 23.5039 38.4789 51.7280
frequency: 23.0975 38.4620 51.3851 64.8495 68.4757 106.5309 121.0534 134.8800 168.6283 190.7012 227.9079 252.3185 255.4534 275.3230 276.3615 283.8366 340.7512 344.2444 364.7480 382.8366 393.5425 530.0996 543.2048 564.0315 609.4597 694.8416 707.1450 766.3782 789.7585 908.8598 925.3696 932.5162 935.5280 992.6562 1007.5290 1014.8022 1059.2558 1077.0563 1091.3000 1105.9476 1111.8107 1157.8030 1183.3725 1221.1638 1232.2203 1262.2062 1264.0140 1302.0125 1328.5410 1346.6483 1375.3454 1378.3096 1396.0087 1441.4442 1449.3317 1450.6421 1464.5745 1469.3127 1469.9064 1473.8099 1485.7260 1639.0768 1641.8712 2906.2696 2971.8970 2976.5247 2994.8959 3006.7395 3014.5748 3045.7525 3053.6115 3054.9690 3059.9380 3084.3935 3098.9433 3101.6882 3105.1645 3473.8605 3481.0640 3603.5670 3611.0373
redmass: 4.7341 5.0468 2.0782 2.1717 2.6074 3.6653 2.7944 3.0482 1.8595 1.9085 2.4624 2.0057 1.8222 1.5244 1.4075 1.0480 2.7538 3.4231 3.5979 4.4921 4.4909 1.5271 4.2496 1.3334 3.5343 6.0306 5.4657 1.1025 1.1144 2.7619 1.2292 1.4350 1.4114 1.2580 4.1942 2.2740 1.0592 1.5669 4.1400 2.2102 1.8182 2.0108 3.9135 1.2575 1.2026 1.3495 1.3185 1.1076 1.1499 1.2234 1.3524 1.2059 1.2027 1.0750 1.0783 1.0499 1.0585 1.0460 1.0844 1.0473 1.0847 1.0942 1.0906 1.0709 1.0364 1.0366 1.0564 1.0593 1.0574 1.0895 1.0989 1.1040 1.0978 1.1094 1.1084 1.0990 1.0989 1.0444 1.0449 1.0988 1.0988
irintensity: 0.4062 0.7881 4.6760 0.6277 2.6069 1.1014 0.2600 1.7808 31.7901 38.0673 4.1288 1.8595 1.0422 17.4169 30.8409 3.5148 3.9381 2.5739 3.5920 1.7143 22.6988 407.0527 19.7409 239.7251 6.8672 51.3441 10.6506 5.9212 5.8141 0.3461 0.2096 0.0933 1.4795 0.0662 23.7742 11.0658 0.6256 9.9993 36.5431 3.8054 151.0162 16.7896 5.6720 3.7065 5.0994 0.0774 3.5861 1.6275 0.0085 0.5792 8.4095 31.8376 13.4700 11.8227 1.6802 0.2572 6.9702 13.7203 10.0420 12.3453 3.4376 35.0380 36.4703 70.3539 13.8751 34.2068 11.9126 48.2373 25.2616 18.9366 0.7308 2.3906 72.5467 47.3751 28.8932 12.6938 16.4944 4.9799 0.3184 1.3668 2.2478
temp: 298.150 k
press: 1.00000 atm
elementType: 16 16 7 7 6 6 6 6 6 6 6 1 1 1 1 1 1 1 1 1 1 1 1 1 1 1 1 1 1
symmnumber: 1
zpe: 650835.3 jmol-1
zpe.correction: 0.247890 hartree
zpe.thermalcorrener: 0.264494 hartree
zpe.thermalcorrenthalpy: 0.265438 hartree
zpe.thermalcorrgfe: 0.202401 hartree
zpe.sumelectzpe: -1182.202997 hartree
zpe.sumelectthermal: -1182.186393 hartree
zpe.sumelectthermalent: -1182.185449 hartree
zpe.sumelectthermalfe: -1182.248486 hartree
dipole: 1.4684 3.2229 0.1673
dipole: 3.5456
quadrupole: -72.3286 -87.9518 -82.1338
quadrupole: -11.1153 -5.9239 -1.3863
quadrupole: 8.4761 -7.1471 -1.3290 -11.1153 -5.9239 -1.3863
hfenergy: -1182.4508872 hartree
pointgroup: C01 [X(C7H18N2S2)]
dipole: -0.5877832 1.2648036 -0.0265712 debye
polarizability: 202.932628|1.3112153|107.6512374|-3.6913504|1.3348158|95.4659111 unknown
InChI: InChI=1S/C7H18N2S2/c1-7(2,10-5-3-8)11-6-4-9/h3-6,8-9H2,1-2H3
charge 0 multiplicity 1
29 atoms
S  -1.486909 -0.986088 -0.075454
S  1.464184 -0.962414 0.151814
N  -5.428132 0.251781 0.178649
N  5.468628 0.235203 -0.112494
C  -0.022139 0.26098 0.033115
C  0.045728 1.10153 -1.250924
C  -0.103048 1.110221 1.310702
C  -2.968152 0.162479 0.247467
C  2.937099 0.198051 -0.183074
C  -4.25886 -0.597542 -0.116556
C  4.254202 -0.558087 0.136666
H  0.164968 0.454228 -2.134954
H  0.887635 1.819006 -1.213378
H  -0.884645 1.688578 -1.371877
H  0.81676 1.715398 1.425028
H  -0.957687 1.81192 1.269065
H  -0.208549 0.468133 2.200259
H  -2.971464 0.45141 1.312794
H  -2.883848 1.065283 -0.379574
H  2.91795 0.509639 -1.242207
H  2.843183 1.088329 0.465873
H  -4.250312 -0.815969 -1.199772
H  -4.266961 -1.580252 0.410992
H  4.246246 -0.874888 1.195679
H  4.306103 -1.48132 -0.469915
H  -5.646774 0.35422 1.173057
H  -6.256472 0.067134 -0.391189
H  5.594826 1.043562 0.5023
H  5.653945 0.452574 -1.095194
