program: Gaussian 09
title: 000031568
version: EM64L-G09RevD.01
frameworkgroup: C1[X(C8H16O2S)]
method: RPBEPBE
basis: SDD
operation: Freq
keyword: #p
keyword: freq=noraman
keyword: PBEPBE/SDD
title: #p freq=noraman PBEPBE/SDD
converged: YES YES NO NO
title: Mulliken charges:
elementType: S O O C C C C C C C C H H H H H H H H H H H H H H H H
charge: -0.027749 -0.274196 -0.232830 -0.336676 -0.364458 -0.355718 -0.516668 -0.693146 0.252257 -0.199041 -0.704380 0.184570 0.185951 0.208599 0.219129 0.198183 0.197597 0.243203 0.243878 0.209486 0.209330 0.217944 0.250128 0.230350 0.272467 0.263788 0.118000
chargesum: 0.00000
title: Mulliken charges with hydrogens summed into heavy atoms:
elementType: S O O C C C C C C C C
charge: 0.090251 -0.274196 -0.232830 0.033845 0.063271 0.040062 -0.029588 -0.056386 0.252257 0.281438 -0.168125
polarizability: 1.39356137e+02 7.84284066e-01 1.03815385e+02 -8.34788356e-01 1.66740789e+00 8.40572612e+01
1716.lowfreq: -19.3008 -4.7401 -0.0003 0.0004 0.0015 5.1369 10.6514 34.5402 38.2560
frequency: -16.8512 34.4128 38.1038 61.2232 72.4100 95.3598 122.5349 148.1073 182.9775 220.5763 227.7113 251.6510 268.9747 298.3110 388.8691 417.5161 476.0106 551.2767 618.3381 679.6445 723.9796 729.8351 751.4829 832.3338 839.5010 885.9134 922.1779 955.9520 968.0352 1001.9280 1017.1847 1065.1744 1071.7881 1074.9557 1101.6872 1113.8138 1131.3052 1184.1687 1198.3759 1230.8004 1244.4915 1255.4205 1287.5418 1291.2000 1295.4925 1306.4845 1347.4956 1357.5709 1365.8798 1389.4474 1433.6864 1438.6664 1457.1013 1464.1456 1469.3114 1476.6978 1479.3726 1487.9498 1647.8296 2445.3344 2951.5673 2969.4960 2972.2243 2980.7368 2992.4701 2994.4989 3002.4692 3022.2607 3033.7799 3041.5601 3061.2369 3069.3901 3072.5143 3078.1416 3115.4748
redmass: 2.1906 5.2267 3.9260 3.8999 3.5323 1.7459 2.4078 2.9754 4.7377 3.0544 1.1117 1.3118 3.3776 2.3581 3.3086 2.9852 3.3185 2.7396 4.7367 4.8596 1.0844 1.3043 1.1949 2.3702 1.3448 2.3861 3.0956 1.2502 1.6721 2.0905 3.2356 2.5000 2.8499 2.1194 2.0721 1.9234 2.7730 1.1124 1.5437 1.1910 1.3524 1.2507 1.0612 1.1171 1.2213 1.4229 1.4665 1.5350 1.6705 1.2193 1.0948 1.0855 1.0789 1.0693 1.0730 1.0428 1.0699 1.0878 9.9511 1.0379 1.0589 1.0585 1.0371 1.0631 1.0856 1.0726 1.0591 1.1015 1.0983 1.0599 1.1024 1.1010 1.0992 1.1039 1.1064
irintensity: 0.1331 1.4333 1.1160 0.2983 1.3337 0.3908 0.1446 0.8613 5.3863 3.3351 0.0137 39.9283 4.9016 10.2085 4.4161 2.8388 6.5179 2.4493 5.6212 4.3662 14.8915 5.3143 0.2203 3.1408 4.3121 24.8193 14.8895 0.3143 1.8884 9.5876 48.7501 3.2064 55.3526 17.7571 124.1729 10.2948 217.0242 0.1084 1.2003 3.7127 48.2176 2.9884 0.0776 1.2122 12.2457 38.8084 9.4047 0.4195 17.1418 10.3705 12.3648 22.6679 12.4481 0.3039 0.9143 12.6954 5.5922 21.2463 170.7427 15.6957 15.3316 51.1375 33.1613 4.5536 16.6846 28.5179 19.4751 16.1462 4.0883 18.9303 19.2813 119.7037 51.9456 16.5436 13.1064
temp: 298.150 k
press: 1.00000 atm
elementType: 16 8 8 6 6 6 6 6 6 6 6 1 1 1 1 1 1 1 1 1 1 1 1 1 1 1 1
symmnumber: 1
zpe: 593666.8 jmol-1
zpe.correction: 0.226116 hartree
zpe.thermalcorrener: 0.239736 hartree
zpe.thermalcorrenthalpy: 0.240680 hartree
zpe.thermalcorrgfe: 0.183739 hartree
zpe.sumelectzpe: -862.050649 hartree
zpe.sumelectthermal: -862.037029 hartree
zpe.sumelectthermalent: -862.036085 hartree
zpe.sumelectthermalfe: -862.093026 hartree
dipole: -0.9316 -0.3790 1.6950
dipole: 1.9709
quadrupole: -76.7138 -80.8171 -76.1495
quadrupole: 9.0335 3.6461 2.8694
quadrupole: 1.1797 -2.9236 1.7439 9.0335 3.6461 2.8694
hfenergy: -862.2767647 hartree
pointgroup: C01 [X(C8H16O2S1)]
dipole: -0.3612659 0.2419825 -0.6420323 debye
polarizability: 139.2941941|0.7192369|102.6883434|1.928421|4.9199432|85.2462456 unknown
InChI: InChI=1S/C8H16O2S/c1-2-3-4-5-8(9)10-6-7-11/h11H,2-7H2,1H3
charge 0 multiplicity 1
27 atoms
S  4.47459 1.670689 0.814996
O  1.926046 0.065898 -0.32098
O  0.722767 -1.843154 0.255526
C  -3.014612 0.511555 -0.2029
C  -1.794247 -0.368328 0.14496
C  -4.349269 -0.088334 0.295014
C  -0.470234 0.24894 -0.346868
C  -5.570976 0.786828 -0.058237
C  0.733573 -0.64184 -0.092289
C  3.189069 -0.703928 -0.129964
C  4.334206 0.252451 -0.432451
H  -3.068164 0.654059 -1.303027
H  -2.884634 1.523373 0.235878
H  -1.743919 -0.522072 1.240517
H  -1.914983 -1.37446 -0.299441
H  -4.478282 -1.099932 -0.140831
H  -4.297999 -0.22861 1.393939
H  -0.518035 0.442661 -1.438135
H  -0.284507 1.233512 0.122728
H  -5.483153 1.792876 0.394016
H  -5.661549 0.918608 -1.153131
H  -6.511412 0.334191 0.305975
H  3.225544 -1.085506 0.905383
H  3.184723 -1.564484 -0.825993
H  4.237912 0.676915 -1.444532
H  5.297028 -0.279709 -0.357532
H  3.200717 2.164401 0.589679
