program: Gaussian 09
title: 000003355
version: EM64L-G09RevD.01
frameworkgroup: C1[X(C17H21F6N2O3)]
method: RPBEPBE
basis: SDD
operation: Freq
keyword: #p
keyword: freq=noraman
keyword: PBEPBE/SDD
title: #p freq=noraman PBEPBE/SDD
converged: YES YES NO NO
title: Mulliken charges:
elementType: F F F F F F O O O N N C C C C C C C C C C C C C C C C C H H H H H H H H H H H H H H H H H H H H H
charge: -0.139330 -0.145330 -0.135889 -0.134519 -0.154045 -0.133287 -0.078348 -0.218450 -0.233512 -0.334468 -0.568594 -0.040891 -0.377257 -0.422094 -0.357238 -0.448140 -0.424620 0.093727 0.282558 0.236234 -0.437296 0.317352 -0.297472 -0.344682 -0.341695 -0.336381 0.392188 0.388377 0.210576 0.159822 0.199070 0.211388 0.242895 0.284491 0.290501 0.225906 0.216972 0.201739 0.242233 0.275758 0.385368 0.406819 0.227453 0.279509 0.294353 0.271626 0.268801 0.251657 0.246166
chargesum: 1.00000
title: Mulliken charges with hydrogens summed into heavy atoms:
elementType: F F F F F F O O O N N C C C C C C C C C C C C C C C C C
charge: -0.139330 -0.145330 -0.135889 -0.134519 -0.154045 -0.133287 -0.078348 -0.218450 -0.233512 -0.058710 0.223593 0.169685 -0.018365 0.032189 0.085640 0.126851 0.019352 0.093727 0.282558 0.236234 -0.209843 0.317352 -0.017963 -0.050329 0.198732 0.161441 0.392188 0.388377
polarizability: 3.00736939e+02 2.22958410e+01 2.54146971e+02 -2.07385258e+00 -2.43246858e+00 1.40644364e+02
1716.lowfreq: -11.6077 -4.5721 -0.0008 -0.0008 0.0004 3.0126 6.0832 11.5279 15.5855
frequency: -5.5418 11.1755 15.0477 19.0120 32.7595 36.9404 44.3068 45.5189 55.5281 72.5441 95.5964 102.4759 121.8312 131.6538 144.5162 147.4132 166.0698 172.0876 183.3228 199.6986 207.4112 291.8525 294.0477 316.6887 320.1742 324.9482 326.7773 352.6555 355.4864 401.8741 411.8730 418.5014 434.1804 444.3652 459.5973 468.7339 469.4002 471.9396 500.9586 508.4784 525.8623 528.4307 541.1714 575.9882 584.7940 617.9420 666.4855 674.6807 693.2322 743.4327 751.7363 767.2655 785.0119 797.9782 799.0641 820.6284 825.3967 837.2434 841.3436 860.8984 896.1211 904.6656 912.6144 919.0347 929.5004 949.8786 974.9346 975.7967 979.6948 1000.3645 1017.2433 1035.9328 1039.6416 1053.9890 1084.2042 1094.3191 1096.4168 1100.8151 1103.8642 1129.3202 1141.8364 1149.5111 1176.0345 1194.1593 1210.6886 1213.5895 1218.3655 1239.8290 1245.4082 1258.3041 1258.4850 1261.4917 1272.3456 1277.3782 1299.1602 1301.5032 1315.1122 1321.8950 1333.7034 1343.1317 1351.0291 1357.7547 1377.7611 1379.9051 1388.6941 1399.2712 1415.6026 1440.5590 1447.4515 1452.1978 1457.6830 1466.2045 1468.4336 1474.6014 1476.5782 1493.9992 1563.3944 1614.1045 1634.6531 1710.0251 2797.4033 2901.1838 2934.3147 2981.7799 2985.2650 3001.7694 3003.8135 3013.7601 3033.6420 3054.6648 3057.5849 3062.7090 3073.8052 3090.3611 3111.4425 3154.5859 3170.3944 3187.0462 3320.0090 3410.9860 3437.0015
redmass: 5.2129 5.9002 4.8155 5.9788 12.3500 10.4655 8.8461 10.8387 4.9798 4.6267 5.2632 5.0032 6.6541 5.7990 5.6737 4.4232 6.3822 3.3483 6.2825 6.3115 2.0515 6.2403 9.0053 1.7544 3.5543 3.5545 3.8501 6.0737 5.5379 6.0665 7.3799 3.3182 4.2494 3.8693 3.5642 6.2553 6.6913 3.1762 9.1309 8.2733 4.5838 1.8555 2.5415 4.9619 6.3444 8.4667 2.8844 5.1618 2.3566 3.1573 3.2256 7.1255 2.5306 4.9059 6.3700 1.4911 1.9417 1.5511 1.9103 2.0530 1.8709 3.1356 2.4561 2.4907 3.1682 3.3054 1.4216 2.3384 7.3382 1.6581 4.0939 8.0869 9.5203 2.4138 1.5784 2.0372 1.5164 1.9996 1.9170 2.4265 1.8677 1.6230 1.4179 2.1495 4.0962 3.1950 1.5748 3.2929 1.2681 1.3273 1.3134 1.2981 1.5647 2.5459 1.3787 1.4481 1.2676 1.1583 1.2969 1.3771 1.4805 1.4837 1.7008 1.4428 1.5247 3.7737 4.2147 1.0953 1.1302 1.0849 1.0883 1.0955 1.2189 1.1047 1.1160 2.3710 7.7722 2.7437 1.3716 9.5073 1.0799 1.0709 1.0588 1.0727 1.0551 1.0907 1.0631 1.0557 1.0594 1.1078 1.0979 1.0914 1.1035 1.1090 1.1078 1.0902 1.0891 1.0977 1.0485 1.0944 1.0748
irintensity: 0.1288 0.2409 0.3144 2.0989 2.3885 0.0588 0.4837 5.4193 1.4746 1.8834 2.5342 2.0813 1.4002 4.1608 0.4443 7.6394 8.1453 2.8348 4.2922 5.2856 6.0574 6.2815 6.6739 2.3538 7.6254 3.1992 7.8695 0.9202 1.4854 6.1922 2.7276 3.9771 0.7636 16.2002 7.8822 1.7442 0.4773 16.1335 7.6176 1.9584 7.9081 10.1088 14.6346 38.3326 42.8020 1.9094 109.1968 12.7779 29.4506 1.6125 64.7436 52.6568 12.9618 21.6261 95.8733 7.6537 3.8027 38.4237 24.2138 17.7804 4.0538 20.3859 97.6603 85.9931 27.4341 11.8970 1.8073 4.2990 57.9848 1.7900 23.4344 110.4634 493.5206 25.3231 3.5493 77.9950 6.0287 79.4842 12.1110 37.8304 1.2871 21.0715 6.5036 463.4828 9.7832 370.3433 21.5249 47.2557 74.9306 111.1822 40.8767 38.4182 188.5349 78.1481 25.3655 38.5924 27.6321 14.5092 8.1703 1.9579 3.0415 2.8590 3.2887 12.4412 2.8058 65.1568 13.1776 9.0951 102.2165 13.9775 12.3127 19.5807 9.4054 16.1111 5.7181 284.9702 93.7516 37.7256 62.6294 300.5534 80.0441 97.1382 90.5397 5.6929 22.7797 46.7947 34.1372 18.6950 4.8852 11.5708 25.3912 30.2168 40.4293 3.5329 6.0085 7.7224 2.6056 1.6905 31.8233 44.8815 1.3597
temp: 298.150 k
press: 1.00000 atm
elementType: 9 9 9 9 9 9 8 8 8 7 7 6 6 6 6 6 6 6 6 6 6 6 6 6 6 6 6 6 1 1 1 1 1 1 1 1 1 1 1 1 1 1 1 1 1 1 1 1 1
symmnumber: 1
zpe: 976151.2 jmol-1
zpe.correction: 0.371796 hartree
zpe.thermalcorrener: 0.398946 hartree
zpe.thermalcorrenthalpy: 0.399891 hartree
zpe.thermalcorrgfe: 0.309177 hartree
zpe.sumelectzpe: -1592.211312 hartree
zpe.sumelectthermal: -1592.184162 hartree
zpe.sumelectthermalent: -1592.183218 hartree
zpe.sumelectthermalfe: -1592.273932 hartree
dipole: -2.5636 -4.4801 1.9587
dipole: 5.5208
quadrupole: -139.2980 -130.5391 -155.4678
quadrupole: 48.8366 -5.2249 -3.7942
quadrupole: 2.4703 11.2292 -13.6995 48.8366 -5.2249 -3.7942
hfenergy: -1592.5831084 hartree
pointgroup: C01 [X(C17H21F6N2O3)]
dipole: -0.9341284 -1.7717089 0.8404297 debye
polarizability: 298.6855236|24.226759|255.8099523|-2.0029876|-7.2440177|141.0327977 unknown
InChI: InChI=1S/C17H21F6N2O3/c18-16(19,20)9-27-12-4-5-14(28-10-17(21,22)23)13(7-12)15(26)25-8-11-3-1-2-6-24-11/h4-5,7,11,24H,1-3,6,8-10,25H2
charge 1 multiplicity 1
49 atoms
F  5.920034 -0.791064 1.266805
F  7.216358 0.458923 -0.125658
F  5.887839 -1.186304 -0.966464
F  -3.480962 4.431039 0.781443
F  -4.869452 2.827955 -0.04654
F  -3.588322 4.075816 -1.455726
O  2.211518 -2.096054 0.323347
O  3.593879 0.174899 -0.008759
O  -1.241964 3.008552 -0.253995
N  -2.787105 -3.905184 -0.955542
N  -0.098637 -1.965058 0.887811
C  -2.173676 -3.287502 0.232497
C  -3.161765 -2.265871 0.85787
C  -4.538128 -2.912019 1.149087
C  -5.11023 -3.548033 -0.137206
C  -0.884555 -2.596847 -0.270017
C  -4.106452 -4.55784 -0.721716
C  1.280365 -1.285667 0.394996
C  1.197452 0.146829 0.137228
C  2.414978 0.887177 -0.072028
C  -0.056146 0.843732 0.081589
C  -0.090939 2.226052 -0.164482
C  2.353516 2.286972 -0.310901
C  1.122139 2.945511 -0.355796
C  4.871136 0.881044 -0.1644
C  -2.53415 2.356779 -0.082805
C  5.961996 -0.177854 0.00481
C  -3.602836 3.443541 -0.205911
H  -1.899756 -4.037174 1.025962
H  -2.749703 -1.85115 1.804294
H  -3.303704 -1.433766 0.135731
H  -4.424254 -3.689421 1.931302
H  -5.231033 -2.151693 1.551859
H  -1.139247 -1.802791 -0.990879
H  -0.193871 -3.310073 -0.753478
H  -6.063258 -4.062509 0.080603
H  -5.318982 -2.762518 -0.887865
H  -4.017562 -5.424525 -0.024009
H  -4.466255 -4.942809 -1.691274
H  -2.139543 -4.534084 -1.450361
H  -0.702546 -1.309345 1.416233
H  0.210396 -2.720688 1.530196
H  -0.998667 0.297819 0.183556
H  3.266913 2.866449 -0.465664
H  1.06287 4.021548 -0.543975
H  4.960248 1.326925 -1.171394
H  5.000747 1.652775 0.615926
H  -2.714386 1.60179 -0.872624
H  -2.626999 1.895819 0.919922
