program: Gaussian 09
title: 000031521
version: EM64L-G09RevD.01
frameworkgroup: C1[X(C13H15NO4)]
method: RPBEPBE
basis: SDD
operation: Freq
keyword: #p
keyword: freq=noraman
keyword: PBEPBE/SDD
title: #p freq=noraman PBEPBE/SDD
converged: YES YES NO NO
title: Mulliken charges:
elementType: O O O O N C C C C C C C C C C C C C H H H H H H H H H H H H H H H
charge: -0.262618 -0.276507 -0.342445 -0.247236 -0.358490 0.273841 0.109137 0.219468 -0.652138 -0.679715 0.282975 -0.378788 -0.373120 -0.181697 0.281684 -0.454127 -0.010276 -0.544823 0.222029 0.229989 0.255268 0.246804 0.227480 0.225750 0.249784 0.248238 0.228154 0.328126 0.227125 0.249132 0.215131 0.217127 0.224738
chargesum: 0.00000
title: Mulliken charges with hydrogens summed into heavy atoms:
elementType: O O O O N C C C C C C C C C C C C C
charge: -0.262618 -0.276507 -0.342445 -0.247236 -0.030363 0.273841 0.109137 0.219468 0.055148 0.020318 0.282975 -0.129004 -0.124882 0.046457 0.281684 0.022129 0.204855 -0.102957
polarizability: 1.81440785e+02 -1.31160440e+01 1.88809228e+02 8.73786477e+00 5.55457117e+00 1.06947648e+02
1716.lowfreq: -4.3339 -0.0003 -0.0001 0.0003 4.8368 6.9054 22.2786 27.6924 51.0528
frequency: 22.1023 27.4022 51.0367 52.0630 60.1995 74.2257 102.8051 137.5201 160.7536 196.8048 213.7873 237.8702 240.4503 276.9071 295.3813 307.4088 329.0791 350.9092 373.3889 424.7289 476.1888 486.2087 511.3082 525.6205 544.8059 551.2467 582.5844 610.1016 648.1316 661.2641 691.3806 700.3862 714.6177 736.2617 750.1819 773.2364 823.6458 848.8476 871.8334 912.4109 927.7590 943.2473 952.3492 955.7162 967.6115 985.3118 992.6679 999.0636 1043.8182 1070.1722 1095.3423 1146.4842 1158.7807 1176.5045 1195.8380 1206.2917 1235.2600 1256.1279 1264.8099 1266.9712 1288.6434 1346.0184 1384.7380 1395.3102 1407.3695 1429.7748 1446.2508 1448.1069 1450.3712 1450.7270 1465.8571 1467.1920 1471.9547 1486.4079 1610.6123 1625.7028 1660.9402 1709.2247 2992.5094 3002.1268 3008.4181 3076.0143 3088.4723 3103.9387 3105.1140 3110.5291 3112.6819 3121.0287 3148.1555 3171.3224 3185.0119 3200.2791 3572.4542
redmass: 4.4610 3.7168 4.4544 3.4565 4.0493 5.4329 2.8458 3.7829 1.0716 1.6998 1.9591 3.8941 4.1607 5.7465 2.7181 4.1516 4.4484 2.2640 3.4209 2.3404 3.9517 3.8448 4.7356 4.2066 1.1983 4.5632 5.1746 4.2971 2.6375 4.8264 8.0733 4.6659 4.0678 3.5434 6.2925 1.9639 5.8335 3.6738 1.4342 1.8101 1.4719 1.2993 1.7466 1.5704 1.8164 1.3996 2.4959 1.4721 1.9751 5.0060 2.5536 2.0567 1.4270 2.0238 2.9025 2.6801 1.7410 3.1509 1.3615 3.2320 1.2381 1.2205 1.3082 1.2474 4.0754 1.1791 1.7448 1.0628 1.1980 1.3343 2.3955 1.2568 1.0631 1.8765 9.5152 8.3644 4.6904 10.2099 1.0649 1.0352 1.0358 1.0918 1.0687 1.0911 1.1003 1.1008 1.0997 1.1009 1.0870 1.0935 1.0980 1.1150 1.0774
irintensity: 0.4153 0.1096 8.2735 0.8139 2.0714 2.5878 0.0825 1.6676 0.0293 1.2532 0.2541 0.5106 0.8908 1.7489 0.1553 16.3494 1.7297 0.4075 6.4772 1.7595 9.4594 0.3927 2.5720 7.4025 114.1222 2.6752 2.1230 9.1551 28.0695 2.5944 13.7481 12.4263 24.1081 32.0021 29.0059 50.0461 32.7178 87.9333 2.9084 11.1082 4.0614 2.5207 33.4415 42.0711 58.0175 17.6254 116.4170 5.0853 30.3856 69.0242 260.1684 17.2315 146.1290 76.2863 129.5997 173.8053 12.4943 181.9814 33.9105 27.8098 1.0124 1.3853 49.2453 17.0893 42.8556 9.7483 79.0147 3.5539 25.7560 34.7907 135.9499 31.7961 40.4298 217.4366 9.2788 21.8680 6.1739 272.3593 45.8552 5.3666 10.0596 0.6322 16.0301 11.4464 0.6452 13.7709 22.4024 18.6645 7.8907 7.0523 7.3131 23.5868 40.8498
temp: 298.150 k
press: 1.00000 atm
elementType: 8 8 8 8 7 6 6 6 6 6 6 6 6 6 6 6 6 6 1 1 1 1 1 1 1 1 1 1 1 1 1 1 1
symmnumber: 1
zpe: 674325.8 jmol-1
zpe.correction: 0.256837 hartree
zpe.thermalcorrener: 0.274901 hartree
zpe.thermalcorrenthalpy: 0.275845 hartree
zpe.thermalcorrgfe: 0.208832 hartree
zpe.sumelectzpe: -858.669490 hartree
zpe.sumelectthermal: -858.651426 hartree
zpe.sumelectthermalent: -858.650482 hartree
zpe.sumelectthermalfe: -858.717495 hartree
dipole: -1.9123 0.6901 -1.3878
dipole: 2.4615
quadrupole: -92.7663 -91.4149 -106.8855
quadrupole: 1.7658 5.9783 1.2006
quadrupole: 4.2560 5.6074 -9.8633 1.7658 5.9783 1.2006
hfenergy: -858.926327 hartree
pointgroup: C01 [X(C13H15N1O4)]
dipole: 0.6996906 -0.3736979 -0.5555686 debye
polarizability: 177.7370509|-11.7863257|192.1291412|-10.5183404|-4.6224675|107.3314681 unknown
InChI: InChI=1S/C13H15NO4/c1-4-8-14-12(15)16-9-6-5-7-10-11(9)18-13(2,3)17-10/h4-7,14H,1,8H2,2-3H3
charge 0 multiplicity 1
33 atoms
O  -0.806524 -0.910501 -0.510745
O  -3.128287 -0.838186 0.098333
O  0.923356 1.566116 -0.682018
O  1.526312 0.291742 1.242495
N  3.046837 0.794388 -0.484103
C  -1.949944 -1.782277 -0.032947
C  -1.209063 0.409897 -0.239698
C  -2.579823 0.465166 0.096897
C  -1.597563 -2.331398 1.348185
C  -2.261559 -2.807084 -1.111116
C  -0.445182 1.580608 -0.31058
C  -3.245656 1.671158 0.333436
C  -1.091271 2.819192 -0.071204
C  -2.469322 2.859979 0.236784
C  1.82633 0.804108 0.143897
C  4.198907 0.06302 0.075709
C  4.357195 -1.333764 -0.505158
C  4.361913 -2.467586 0.236647
H  -2.44839 -2.904083 1.755453
H  -0.71625 -2.990965 1.275806
H  -1.355591 -1.503958 2.035644
H  -2.510911 -2.299146 -2.056123
H  -1.385826 -3.458165 -1.272501
H  -3.117138 -3.430808 -0.801357
H  -4.309484 1.694299 0.581828
H  -0.495593 3.735072 -0.124842
H  -2.948515 3.827122 0.41848
H  3.110004 1.242804 -1.398489
H  5.109826 0.663106 -0.116441
H  4.055397 0.002602 1.16766
H  4.475554 -1.393733 -1.597668
H  4.489794 -3.45438 -0.222704
H  4.229468 -2.440446 1.32504
