program: Gaussian 09
title: 000031492
version: EM64L-G09RevD.01
frameworkgroup: C1[X(C6H11NO)]
method: RPBEPBE
basis: SDD
operation: Freq
keyword: #p
keyword: freq=noraman
keyword: PBEPBE/SDD
title: #p freq=noraman PBEPBE/SDD
converged: YES YES NO NO
title: Mulliken charges:
elementType: O N C C C C C C H H H H H H H H H H H
charge: -0.295314 -0.064956 -0.081327 -0.112972 0.151064 -0.691665 -0.660092 -0.772329 0.222089 0.230750 0.244344 0.229790 0.205321 0.227835 0.224036 0.220053 0.237199 0.229374 0.256800
chargesum: 0.00000
title: Mulliken charges with hydrogens summed into heavy atoms:
elementType: O N C C C C C C
charge: -0.295314 -0.064956 0.140762 0.117778 0.151064 -0.012209 0.011832 -0.048956
polarizability: 9.31786581e+01 -1.41023989e+00 6.83404226e+01 6.37651506e+00 -1.06311931e+00 5.83316624e+01
1716.lowfreq: -7.5322 -3.7997 -0.0006 -0.0004 0.0006 14.3741 58.7924 129.7956 169.5565
frequency: 58.7538 129.7882 169.5519 216.1736 219.0551 229.3466 285.1571 323.7006 418.4927 479.6718 574.1491 605.9189 723.4953 733.1370 779.0809 844.9834 872.8341 984.2707 1001.0328 1043.5879 1054.4177 1072.2765 1095.6588 1107.5380 1127.7166 1209.0015 1268.9505 1297.9817 1310.8675 1333.6899 1381.4248 1383.9379 1393.9245 1454.6622 1457.2590 1459.8224 1465.1870 1466.1273 1474.1661 1630.4875 2957.4972 2980.1235 2986.0293 2992.6932 2998.3130 3054.9750 3083.8904 3100.4788 3102.2538 3108.5200 3117.0394
redmass: 3.5089 1.2823 1.8183 1.4967 1.1125 1.3899 2.7029 2.8469 2.9181 3.2751 3.7265 3.9986 5.8064 2.8775 2.5954 2.8279 3.1650 1.4833 1.6187 1.6656 2.6561 1.6418 1.9769 2.3202 2.6272 1.5434 1.3378 2.0440 1.2755 1.5496 1.2203 1.2321 1.2946 1.0679 1.0534 1.0502 1.0511 1.0474 1.0472 8.1060 1.0837 1.0385 1.0369 1.0835 1.0361 1.0963 1.0990 1.1007 1.1002 1.1007 1.0984
irintensity: 5.2023 1.8893 0.8044 0.0889 0.7635 0.2042 2.8015 0.6570 0.7118 16.1784 3.6219 5.6894 4.4843 21.2908 5.4835 10.9483 37.8696 22.3354 19.2230 29.9105 10.8129 15.1939 13.3674 7.3093 18.5264 7.1627 12.2541 2.9873 17.7722 10.2335 15.8524 26.3437 25.7115 22.5157 18.5757 6.7466 9.5804 8.9468 8.9173 47.0860 38.8294 12.4009 29.8612 39.1383 17.7874 17.0085 30.1357 20.6222 29.0852 26.5377 11.5886
temp: 298.150 k
press: 1.00000 atm
elementType: 8 7 6 6 6 6 6 6 1 1 1 1 1 1 1 1 1 1 1
symmnumber: 1
zpe: 422396.0 jmol-1
zpe.correction: 0.160882 hartree
zpe.thermalcorrener: 0.169870 hartree
zpe.thermalcorrenthalpy: 0.170814 hartree
zpe.thermalcorrgfe: 0.127375 hartree
zpe.sumelectzpe: -364.553994 hartree
zpe.sumelectthermal: -364.545006 hartree
zpe.sumelectthermalent: -364.544062 hartree
zpe.sumelectthermalfe: -364.587501 hartree
dipole: 1.8808 0.2662 0.5314
dipole: 1.9725
quadrupole: -43.3917 -53.7227 -48.3794
quadrupole: 0.3348 1.3864 2.2270
quadrupole: 5.1062 -5.2247 0.1185 0.3348 1.3864 2.2270
hfenergy: -364.7148758 hartree
pointgroup: C01 [X(C6H11N1O1)]
dipole: 0.7458417 -0.0631043 -0.2048533 debye
dipolederiv: -0.9006394 -0.2585919 0.0636494 -0.0365322 -0.6328351 0.0245661 0.0672621 0.0984759 -0.3853518 -0.6202974 0.1093946 0.0047603 -0.1559749 -0.5479335 0.0582665 0.0788081 0.0491676 -0.3583818 0.5303524 0.1938251 -0.0079191 -0.0591854 0.0059094 0.0977753 0.0106418 0.0438047 0.4010015 0.7352895 0.1209049 -0.023395 0.2241614 0.635204 -0.0530122 -0.0843723 -0.0706323 0.492643 0.5025361 -0.1374609 -0.1641049 -0.0164433 0.4409132 -0.0668064 -0.1840493 -0.1130335 0.019037 -0.0458601 -0.045097 -0.0816453 -0.1041453 -0.0289809 -0.0337689 -0.0643056 -0.0202818 0.0063706 -0.123821 -0.0557505 -0.0873806 0.0039477 0.0176227 -0.0462546 -0.0967578 -0.0191862 -0.0083605 -0.1878996 0.1212528 0.0399672 0.1072629 -0.077966 -0.0093041 0.044523 0.0084732 0.0576752 -0.0268898 -0.0155037 0.0466361 -0.033479 0.046628 -0.0152783 0.0842259 0.0120033 -0.1789774 -0.0311034 -0.0191748 0.0333643 0.0353479 0.013707 -0.0329084 0.0814422 -0.0203503 -0.1648879 0.0877301 0.0305946 -0.0082144 -0.0183904 -0.1331689 0.0342088 -0.0235846 0.0376583 0.089495 0.077879 -0.0178832 0.0411994 -0.0142797 0.0853397 0.0583003 -0.0096509 0.0087018 -0.1252999 -0.1578051 0.0262999 0.0454123 0.0687949 0.0829013 -0.0331454 0.0595897 -0.0340122 0.0621917 -0.0284957 0.0929629 -0.0034341 0.1362618 -0.0435517 -0.0032441 -0.0242778 -0.016878 0.1003186 0.0642154 0.0208826 0.0825141 -0.0026556 0.0889054 -0.0501091 0.015283 -0.0533997 -0.1061183 0.0141459 -0.0871173 0.025329 -0.1301918 -0.0357115 0.0698935 0.0473311 0.0816488 0.0500483 -0.0466685 -0.0379249 -0.0721238 -0.0540069 0.0716613 -0.0721992 -0.1044216 -0.0424602 0.0475336 0.0669084 0.0162784 0.0431006 0.0335694 0.0996214 0.0378429 0.0934405 -0.0092945 -0.1009782 0.0904232 -0.0578916 0.0222845 0.0159383 -0.0882659 0.0351772 0.0088725 0.0595949 0.1020415 unknown
polarizability: 93.1495126|2.7627191|68.6093015|-5.8185106|-0.7419162|58.091929 unknown
InChI: InChI=1S/C6H11NO/c1-4-5(2)8-6(3)7-4/h5-6H,1-3H3
charge 0 multiplicity 1
19 atoms
O  -0.682621 1.222222 -0.075899
N  -0.429323 -1.102459 0.484859
C  0.703844 0.809492 -0.385362
C  -1.391338 0.019382 0.50084
C  0.70506 -0.682025 -0.013602
C  1.71449 1.657246 0.410972
C  -2.649182 -0.278864 -0.318515
C  1.908499 -1.563064 -0.195767
H  0.879299 0.944583 -1.47381
H  -1.651656 0.255628 1.551979
H  1.544707 2.726741 0.200604
H  1.592924 1.494401 1.496298
H  2.753831 1.409372 0.124694
H  -3.303782 0.608969 -0.330835
H  -2.378422 -0.53511 -1.357089
H  -3.201092 -1.125702 0.125982
H  2.759848 -1.197754 0.409453
H  2.24184 -1.561031 -1.251179
H  1.675874 -2.596029 0.105279
