program: Gaussian 09
title: 000031462
version: EM64L-G09RevD.01
frameworkgroup: C1[X(C12H24O3)]
method: RPBEPBE
basis: SDD
operation: Freq
keyword: #pfreq=noraman
keyword: PBEPBE/SDD
title: #p freq=noraman PBEPBE/SDD
converged: YES YES NO NO
title: Mulliken charges:
elementType: O O O C C C C C C C C C C C C H H H H H H H H H H H H H H H H H H H H H H H H
charge: -0.249877 -0.248694 -0.271310 0.336182 -0.406063 -0.392366 -0.471328 0.055659 -0.745563 -0.116916 -0.297982 -0.713198 -0.708121 -0.206535 -0.677668 0.190931 0.230628 0.233420 0.190217 0.222175 0.215146 0.189739 0.261032 0.205254 0.207443 0.210612 0.205722 0.198535 0.227644 0.204342 0.237100 0.237633 0.214281 0.202832 0.186018 0.184306 0.202430 0.227914 0.228429
chargesum: 0.00000
title: Mulliken charges with hydrogens summed into heavy atoms:
elementType: O O O C C C C C C C C C C C C
charge: -0.249877 -0.248694 -0.271310 0.336182 0.015495 0.031271 -0.034007 0.245398 -0.071834 0.093696 0.106275 -0.044112 -0.053376 0.163788 -0.018895
polarizability: 1.81626275e+02 -5.45974296e-01 1.22527927e+02 -1.18998364e-02 5.62851194e-01 1.18193401e+02
1716.lowfreq: -10.4676 -0.0010 -0.0008 -0.0004 6.8641 17.0882 33.4336 45.0516 49.5405
frequency: 33.2545 44.8139 49.3856 72.5906 85.7438 113.2287 124.9330 153.2613 181.6997 191.0062 202.6366 212.4814 225.7569 233.1414 238.1999 258.8497 279.9198 322.1400 339.9269 357.8571 399.0332 408.8749 437.1389 467.8355 486.0231 537.1035 604.2954 660.1540 767.1555 790.6224 817.3057 828.0495 841.9006 858.6147 897.6235 914.2898 927.9439 930.1058 949.5754 958.5075 968.7815 973.8955 986.4800 1004.1552 1035.4385 1055.6566 1069.7103 1074.2397 1114.0776 1122.4720 1136.7714 1146.6941 1175.0647 1178.6786 1185.6664 1200.2223 1213.2248 1245.7155 1252.1148 1274.2188 1298.3696 1310.9087 1317.0617 1324.2370 1334.4457 1350.2549 1356.1871 1358.3713 1363.0789 1375.0750 1389.4500 1391.1953 1396.3732 1409.5838 1449.8909 1456.4088 1459.4556 1463.6308 1466.5806 1474.2700 1475.0796 1477.0013 1478.7353 1486.2523 1487.0825 1497.1176 1497.2962 2864.9190 2910.5534 2918.1880 2921.4324 2928.0832 2961.3139 2965.6470 2975.6493 2977.3438 2980.9350 2987.9043 2994.2247 2996.3104 3036.1283 3065.4534 3068.7402 3071.3123 3074.4581 3082.2750 3089.8780 3092.1136 3095.7360 3098.8202 3100.6836
redmass: 3.2975 1.9835 3.1038 2.6326 3.5534 2.9686 2.3042 2.7486 2.5648 2.1336 1.3464 2.7723 1.3492 1.1608 1.1993 2.7559 2.6661 2.9355 2.3583 2.5546 2.5212 2.0185 2.7851 3.3912 4.8814 3.9946 3.8695 3.6741 3.6312 1.2098 1.0943 3.0160 2.7577 2.8865 2.7869 2.0670 1.5367 1.4353 1.9233 3.3192 1.7931 2.2127 2.3145 2.2329 2.1182 2.3745 4.8441 3.3123 1.6991 2.2234 1.4215 2.1174 1.7432 2.0391 1.8408 1.7465 1.2297 1.5018 1.1561 1.2410 1.3191 1.3547 1.2425 1.5024 1.3843 1.3016 1.3055 1.6341 1.2915 1.2186 1.2150 1.2421 1.2394 1.4497 1.0798 1.0824 1.0409 1.0474 1.0794 1.0631 1.0478 1.0619 1.0497 1.0654 1.0591 1.0787 1.0655 1.0823 1.0555 1.0674 1.0562 1.0681 1.1062 1.1011 1.0596 1.0367 1.0383 1.0368 1.0358 1.0817 1.1025 1.0968 1.0985 1.0970 1.0952 1.0996 1.0999 1.0991 1.0982 1.1000 1.1009
irintensity: 0.1872 2.5915 1.0300 0.1386 1.0774 2.7804 3.7487 1.3720 1.6162 2.1297 1.0269 3.0349 0.5274 0.2487 1.1959 1.7185 0.5666 3.3248 2.9102 2.6442 3.8520 4.6088 2.4010 0.7809 2.5779 1.8335 3.2468 7.5413 4.3765 0.8525 4.6088 5.6340 4.3437 67.4166 15.6283 11.9114 5.4985 5.5034 32.3287 1.8410 11.0501 0.9514 45.9076 5.8054 121.4002 168.8733 59.5902 67.8645 15.7351 27.8148 5.8186 7.4594 0.4325 2.9718 7.8050 6.3216 4.5788 0.6022 0.2664 1.9253 4.4638 0.6978 2.2012 0.5885 0.8036 31.6623 6.4843 5.8549 5.2240 18.7812 25.1325 27.8560 24.6872 3.1329 7.2741 0.9567 11.0687 5.5013 5.7514 14.3198 10.7421 5.8201 8.0839 2.7829 13.4727 3.3920 29.3202 73.8547 32.4122 17.1683 106.2770 106.1891 76.4502 18.3397 35.9417 44.2217 31.0708 31.4527 26.5391 17.7875 40.1361 2.6740 40.6107 50.2325 44.4444 25.8942 46.7022 36.7621 19.5776 31.4025 38.3201
temp: 298.150 k
press: 1.00000 atm
elementType: 8 8 8 6 6 6 6 6 6 6 6 6 6 6 6 1 1 1 1 1 1 1 1 1 1 1 1 1 1 1 1 1 1 1 1 1 1 1 1
symmnumber: 1
zpe: 903286.8 jmol-1
zpe.correction: 0.344044 hartree
zpe.thermalcorrener: 0.362129 hartree
zpe.thermalcorrenthalpy: 0.363073 hartree
zpe.thermalcorrgfe: 0.297855 hartree
zpe.sumelectzpe: -696.063430 hartree
zpe.sumelectthermal: -696.045345 hartree
zpe.sumelectthermalent: -696.044401 hartree
zpe.sumelectthermalfe: -696.109619 hartree
dipole: -1.9930 0.1919 -0.7526
dipole: 2.1390
quadrupole: -91.5720 -95.1243 -94.3256
quadrupole: -7.8088 -0.3324 1.7192
quadrupole: 2.1019 -1.4503 -0.6516 -7.8088 -0.3324 1.7192
hfenergy: -696.4074738 hartree
pointgroup: C01 [X(C12H24O3)]
dipole: 0.7824114 -0.2431278 -0.1920881 debye
polarizability: 181.627443|-0.4643483|120.3144168|-0.165995|-2.2350006|120.4057431 unknown
InChI: InChI=1S/C12H24O3/c1-5-13-7-6-12(4)8-14-11(10(2)3)15-9-12/h10-11H,5-9H2,1-4H3
charge 0 multiplicity 1
39 atoms
O  -1.676852 -1.264417 -0.322743
O  -2.159931 1.0224 0.270544
O  4.006415 0.271195 -0.247791
C  0.217616 0.222526 0.388035
C  -0.245479 -0.957783 -0.513519
C  -0.748792 1.406778 0.092731
C  1.648266 0.680214 -0.013516
C  -2.500064 -0.091422 -0.616845
C  0.11921 -0.166243 1.883025
C  -3.975821 -0.463334 -0.420966
C  2.763854 -0.344087 0.233124
C  -4.27163 -0.865005 1.041999
C  -4.884122 0.694499 -0.895559
C  5.177434 -0.596382 -0.051411
C  6.398316 0.146905 -0.592382
H  -0.06033 -0.70762 -1.583946
H  0.278401 -1.895545 -0.267261
H  -0.58249 2.241943 0.793924
H  -0.593616 1.770051 -0.949425
H  1.905546 1.601728 0.545821
H  1.669834 0.948343 -1.089353
H  -2.289256 0.229231 -1.669556
H  -0.933507 -0.34889 2.15659
H  0.691561 -1.085898 2.103586
H  0.512103 0.644426 2.525499
H  -4.146698 -1.34451 -1.07174
H  2.856325 -0.588018 1.314067
H  2.577161 -1.292599 -0.319951
H  -4.106326 -0.007824 1.717819
H  -5.32235 -1.193302 1.14323
H  -3.613409 -1.690988 1.361627
H  -4.696501 1.601466 -0.294402
H  -5.948172 0.417441 -0.78563
H  -4.706371 0.94411 -1.959143
H  5.297189 -0.826771 1.031401
H  5.026357 -1.559597 -0.589614
H  7.310603 -0.465061 -0.470372
H  6.267263 0.373201 -1.664629
H  6.539363 1.099839 -0.053766
