program: Gaussian 09
title: 000031447
version: EM64L-G09RevD.01
frameworkgroup: C1[X(C10H14N2O)]
method: RPBEPBE
basis: SDD
operation: Freq
keyword: #p
keyword: freq=noraman
keyword: PBEPBE/SDD
title: #p freq=noraman PBEPBE/SDD
converged: YES YES NO NO
title: Mulliken charges:
elementType: O N N C C C C C C C C C C H H H H H H H H H H H H H H
charge: -0.271384 -0.060858 -0.618566 -0.360874 -0.551843 -0.340231 0.526640 -0.692404 -0.341568 -0.561176 -0.262835 0.030456 0.168805 0.205998 0.209730 0.210713 0.206592 0.196182 0.198159 0.212089 0.212842 0.219214 0.247154 0.253169 0.281539 0.353788 0.328671
chargesum: 0.00000
title: Mulliken charges with hydrogens summed into heavy atoms:
elementType: O N N C C C C C C C C C C
charge: -0.271384 -0.060858 0.063893 0.054853 -0.134538 0.054110 0.526640 -0.048259 -0.094414 -0.308007 0.018704 0.030456 0.168805
polarizability: 1.80669468e+02 1.18857159e+00 1.20015587e+02 1.29901398e+01 -1.98471943e+00 7.69336103e+01
1716.lowfreq: -9.4237 -0.0006 0.0002 0.0005 5.1387 8.5770 22.0285 45.4373 66.6288
frequency: 20.6003 45.2471 66.6017 95.9116 105.1930 126.8976 183.6842 226.4961 229.6498 280.1097 327.2714 376.0747 393.4286 408.2057 490.0654 517.3496 568.3424 587.4042 638.5064 695.2452 698.6514 712.7443 729.8369 787.0426 798.0687 823.3058 871.8725 902.5380 917.9424 940.6675 1000.7480 1004.3159 1012.7471 1064.8547 1067.7281 1073.8901 1104.3157 1121.4202 1158.6504 1204.4492 1223.0678 1255.9083 1270.8223 1285.1844 1287.9418 1319.0247 1325.8540 1347.1654 1354.8808 1389.4882 1389.6657 1465.0348 1469.8921 1470.3972 1477.1552 1480.2086 1488.5247 1551.8036 1558.1359 1588.6261 1636.7749 2964.4398 2971.0209 2975.2211 2980.9073 3003.9104 3024.0574 3048.4347 3072.5005 3074.9523 3117.9395 3131.5911 3174.4507 3481.3230 3666.6868
redmass: 3.4090 4.8953 1.6895 5.2798 2.3215 4.5685 3.7006 3.4549 1.1545 4.6676 2.6215 3.8374 3.2494 3.3046 3.9295 3.2505 2.4532 1.7990 7.4040 3.9268 1.0900 3.7638 1.0778 1.2071 4.6442 5.6905 1.6798 1.6331 1.2424 1.4570 2.1604 1.8732 3.2300 1.9768 2.5842 1.4523 2.1865 1.4571 2.6052 1.5135 2.0973 1.3943 1.2419 1.3452 1.2212 1.4272 6.6215 1.5704 2.7166 1.5451 1.6880 1.1141 1.1780 2.2317 1.0424 1.0733 1.0919 1.3363 6.2431 6.2667 6.1083 1.0586 1.0594 1.0364 1.0594 1.0989 1.1022 1.1045 1.1008 1.0994 1.0916 1.0910 1.0955 1.0471 1.1018
irintensity: 0.5218 0.3310 0.1586 9.0273 0.3462 0.2102 14.5554 0.2311 0.9307 0.8551 7.8875 2.8195 1.1202 2.8995 7.6993 42.9342 52.0710 55.5754 1.8955 60.5645 116.2232 10.3161 7.2135 1.0280 2.4723 0.7728 19.5597 8.1205 0.7945 3.6396 3.0009 4.4585 6.9732 2.3775 3.0924 1.6930 24.8845 6.0112 17.6105 1.3305 2.8087 4.3374 2.2046 0.9198 2.0851 1.9084 20.9196 4.0859 133.8647 28.7808 19.0556 0.3046 4.2037 13.5685 13.0266 3.3483 20.8648 213.4601 16.6125 11.4727 254.0279 11.8672 9.0608 34.5691 84.6999 2.5969 2.3940 38.3732 80.3558 51.9869 23.9003 13.1073 2.0438 42.9805 75.7055
temp: 298.150 k
press: 1.00000 atm
elementType: 8 7 7 6 6 6 6 6 6 6 6 6 6 1 1 1 1 1 1 1 1 1 1 1 1 1 1
symmnumber: 1
zpe: 590363.5 jmol-1
zpe.correction: 0.224858 hartree
zpe.thermalcorrener: 0.238042 hartree
zpe.thermalcorrenthalpy: 0.238986 hartree
zpe.thermalcorrgfe: 0.183401 hartree
zpe.sumelectzpe: -573.239761 hartree
zpe.sumelectthermal: -573.226576 hartree
zpe.sumelectthermalent: -573.225632 hartree
zpe.sumelectthermalfe: -573.281217 hartree
dipole: -4.1039 -1.9387 -0.6184
dipole: 4.5807
quadrupole: -82.0303 -75.3192 -79.9059
quadrupole: -13.0236 1.8004 -2.7344
quadrupole: -2.9452 3.7660 -0.8208 -13.0236 1.8004 -2.7344
hfenergy: -573.4646183 hartree
pointgroup: C01 [X(C10H14N2O1)]
dipole: 1.6207637 0.6684559 -0.4172997 debye
polarizability: 180.6822104|-2.4664314|118.4676384|-12.7664242|-8.2474794|78.4688166 unknown
InChI: InChI=1S/C10H14N2O/c1-2-3-4-8-5-6-9(10(11)13)12-7-8/h5-7H,2-4,11H2,1H3
charge 0 multiplicity 1
27 atoms
O  -4.102395 -1.04219 0.751858
N  -1.416833 1.144422 -0.344117
N  -4.027109 1.256821 0.303704
C  3.079782 0.023942 0.284847
C  2.184546 0.005384 -0.987176
C  4.58802 0.067727 -0.048556
C  0.70567 -0.050567 -0.654952
C  5.474826 0.087688 1.215123
C  0.069472 -1.260547 -0.271251
C  -0.097406 1.121337 -0.674827
C  -1.297167 -1.258615 0.072856
C  -2.003956 -0.036109 0.027476
C  -3.471989 0.001619 0.395491
H  2.861002 -0.872939 0.899027
H  2.809853 0.900606 0.90723
H  2.466567 -0.869606 -1.605976
H  2.402207 0.908241 -1.590476
H  4.849951 -0.810381 -0.673645
H  4.800179 0.964147 -0.666257
H  5.302062 -0.811985 1.835031
H  5.254323 0.973132 1.840345
H  6.548408 0.117229 0.954004
H  0.643179 -2.194653 -0.248999
H  0.341044 2.082309 -0.971841
H  -1.836364 -2.161714 0.372124
H  -3.422427 2.026122 0.004226
H  -5.009547 1.394579 0.530333
