program: Gaussian 09
title: 000031422
version: EM64L-G09RevD.01
frameworkgroup: C1[X(C14H8O8)]
method: RPBEPBE
basis: SDD
operation: Freq
keyword: #pfreq=noraman
keyword: PBEPBE/SDD
title: #p freq=noraman PBEPBE/SDD
converged: YES YES YES YES
title: Mulliken charges:
elementType: O O O O O O O O C C C C C C C C C C C C C C H H H H H H H H
charge: -0.418553 -0.418532 -0.418515 -0.418539 -0.238420 -0.238422 -0.238420 -0.238419 0.169644 0.169646 0.171695 0.171734 0.171763 0.171720 -0.361615 -0.361612 -0.361619 -0.361616 0.092078 0.092078 0.092070 0.092079 0.281560 0.281542 0.281531 0.281547 0.388397 0.388398 0.388399 0.388398
chargesum: 0.00000
title: Mulliken charges with hydrogens summed into heavy atoms:
elementType: O O O O O O O O C C C C C C C C C C C C C C
charge: -0.030156 -0.030133 -0.030115 -0.030141 -0.238420 -0.238422 -0.238420 -0.238419 0.169644 0.169646 0.171695 0.171734 0.171763 0.171720 -0.080055 -0.080069 -0.080088 -0.080068 0.092078 0.092078 0.092070 0.092079
polarizability: 2.59282674e+02 7.66695870e-04 2.18603541e+02 7.24847863e-04 4.37273200e-03 9.01944544e+01
1716.lowfreq: -9.3410 -5.6555 -5.4473 -0.0008 -0.0007 -0.0006 36.2829 44.6265 52.5274
frequency: 36.2829 44.6240 52.5269 67.2013 72.3123 98.0371 111.9794 148.8432 162.0946 185.1748 186.3781 208.8563 236.6440 239.5348 286.6632 290.1310 299.8315 311.0041 386.8435 415.5473 458.3685 459.6213 483.5332 499.5343 531.8242 548.9653 572.4362 582.1359 584.5215 586.8587 599.4245 605.3276 619.6008 648.4584 665.5881 684.0895 687.9596 715.3023 738.6506 741.3019 742.4399 793.0238 796.9097 853.5043 882.8178 883.0865 956.0335 988.0406 988.6868 991.6138 1043.4696 1054.4615 1119.6060 1126.1502 1147.6085 1158.0763 1201.6417 1207.1156 1214.7665 1316.8121 1319.9814 1320.0607 1321.4646 1333.7172 1366.1413 1397.8450 1401.4716 1456.8050 1529.3023 1564.6253 1578.5325 1589.3603 1625.9237 1628.4265 1635.7790 1636.7280 3174.1255 3174.2957 3190.8058 3190.8728 3524.9910 3525.0139 3525.7245 3526.0238
redmass: 8.0905 12.3973 11.3484 7.2132 5.7469 8.9988 9.1894 8.5877 5.5613 12.0451 13.0385 7.0394 5.9609 7.1012 8.8238 8.5608 7.8366 8.0188 6.7219 4.4174 3.2024 6.4935 8.1024 4.8245 2.7677 3.4203 1.8705 1.4366 2.3907 3.3688 2.0921 2.0533 2.4750 3.1995 3.6334 4.9236 6.0699 5.0425 5.6510 5.0954 7.3607 5.6816 8.7466 7.6010 1.4220 1.4458 7.6522 1.4261 1.4265 7.2075 3.4574 3.0391 1.6437 2.5904 2.1634 1.8899 1.7253 1.7816 1.6199 2.5674 3.4267 1.7999 2.3669 2.9195 9.4276 6.6834 4.1052 3.0813 5.5890 5.6853 8.5512 7.8191 9.1922 8.8231 8.5816 8.8915 1.0892 1.0893 1.0966 1.0964 1.0641 1.0641 1.0641 1.0641
irintensity: 0.0000 8.3945 3.0208 0.5352 0.2354 5.7400 0.0000 0.1899 5.9867 0.0000 0.0409 0.3763 3.9333 0.0000 5.0649 0.0001 3.0850 0.3061 0.0000 4.2725 1.7198 6.6695 18.0990 133.6714 0.0000 30.2923 143.1103 142.8771 0.0000 36.3749 5.1737 16.6173 0.0000 187.9608 0.0000 8.3232 38.4415 138.1201 1.7664 54.5169 0.0001 0.0132 19.6631 41.7408 56.9090 15.9828 0.0000 4.1392 0.0006 5.4143 837.6620 655.9925 0.0000 3.8169 78.9619 0.0000 0.6706 33.9641 0.0017 47.8773 0.0036 220.4291 0.1530 0.0000 0.7832 0.0000 68.6772 0.0899 81.7892 10.2536 67.1120 0.0000 324.8516 234.5247 223.6043 0.0052 0.0684 0.1631 0.0528 0.0002 1.9970 54.8409 171.0237 0.0096
temp: 298.150 k
press: 1.00000 atm
elementType: 8 8 8 8 8 8 8 8 6 6 6 6 6 6 6 6 6 6 6 6 6 6 1 1 1 1 1 1 1 1
symmnumber: 1
zpe: 519525.6 jmol-1
zpe.correction: 0.197877 hartree
zpe.thermalcorrener: 0.216802 hartree
zpe.thermalcorrenthalpy: 0.217746 hartree
zpe.thermalcorrgfe: 0.150112 hartree
zpe.sumelectzpe: -1138.574262 hartree
zpe.sumelectthermal: -1138.555336 hartree
zpe.sumelectthermalent: -1138.554392 hartree
zpe.sumelectthermalfe: -1138.622026 hartree
dipole: -0.0001 -0.0001 0.0000
dipole: 0.0001
quadrupole: -106.3338 -102.2709 -134.9766
quadrupole: -0.0001 -0.0002 0.0014
quadrupole: 8.1933 12.2562 -20.4495 -0.0001 -0.0002 0.0014
hfenergy: -1138.7721386 hartree
pointgroup: C01 [X(C14H8O8)]
dipole: 0.0000219 0.000025 -0.0000146 debye
polarizability: 259.2826738|0.0024373|218.6035416|-0.0007247|-0.0043728|90.1944544 unknown
InChI: InChI=1S/C14H8O8/c15-11(16)5-1-2-6(12(17)18)10-8(14(21)22)4-3-7(9(5)10)13(19)20/h1-4,15,17,19,21H
charge 0 multiplicity 1
30 atoms
O  3.448136 -2.539358 0.230155
O  -3.448069 -2.539622 -0.229805
O  3.448108 2.539483 -0.229998
O  -3.448321 2.539306 0.229899
O  3.436847 -0.498618 1.327493
O  -3.436995 -0.499029 -1.327441
O  3.436832 0.498887 -1.327636
O  -3.436927 0.498695 1.327494
C  0.726112 0.000081 -0.000157
C  -0.726203 -0.000018 -0.000112
C  1.414583 -1.263421 0.169114
C  -1.414504 -1.263624 -0.169294
C  1.414409 1.263665 -0.169475
C  -1.414659 1.263497 0.169111
C  0.699077 -2.466332 0.11586
C  -0.698829 -2.466436 -0.115977
C  0.698747 2.466485 -0.116173
C  -0.699146 2.466402 0.11575
C  2.841726 -1.338224 0.610439
C  -2.841644 -1.338655 -0.610609
C  2.841515 1.33864 -0.610924
C  -2.841779 1.338341 0.610515
H  1.235182 -3.409093 0.247221
H  -1.234804 -3.409276 -0.247288
H  1.234719 3.409314 -0.247569
H  -1.235237 3.409172 0.247091
H  4.378846 -2.550165 0.581954
H  -4.378882 -2.550438 -0.581333
H  4.378936 2.550189 -0.581486
H  -4.379075 2.550053 0.581582
