program: Gaussian 09
title: 000031476
version: EM64L-G09RevD.01
frameworkgroup: C1[X(C14H24N2O2)]
method: RPBEPBE
basis: SDD
operation: Freq
keyword: #p
keyword: freq=noraman
keyword: PBEPBE/SDD
title: #p freq=noraman PBEPBE/SDD
converged: YES YES NO NO
title: Mulliken charges:
elementType: O O N N C C C C C C C C C C C C C C H H H H H H H H H H H H H H H H H H H H H H H H
charge: -0.176594 -0.293650 -0.399969 -0.120939 0.354416 0.258471 -0.239956 -0.547078 -0.186618 -0.479223 -0.008846 -0.785303 -0.787364 -0.814535 -0.460160 0.230063 -0.615659 -0.632715 0.241476 0.246633 0.241707 0.258260 0.224877 0.251281 0.216908 0.234571 0.216172 0.237449 0.215492 0.214673 0.242405 0.209997 0.225230 0.336875 0.232095 0.201823 0.285660 0.222800 0.224759 0.237292 0.256309 0.230914
chargesum: 0.00000
title: Mulliken charges with hydrogens summed into heavy atoms:
elementType: O O N N C C C C C C C C C C C C C C
charge: -0.176594 -0.293650 -0.063094 -0.120939 0.354416 0.258471 0.001520 -0.058738 0.071642 -0.003066 -0.008846 -0.117652 -0.119750 -0.136902 -0.026241 0.230063 0.117560 0.091800
polarizability: 2.03132209e+02 5.42025889e+00 1.60588059e+02 -4.26629710e-01 3.04323106e-01 1.34505328e+02
1716.lowfreq: -5.0360 -0.0007 -0.0001 0.0006 5.8975 13.6772 27.6998 31.8326 49.5749
frequency: 26.9431 31.7400 49.2395 55.1077 80.9241 119.9684 137.1879 149.9010 157.2399 168.7099 184.1853 186.4092 208.1656 214.5743 233.1664 238.0142 243.7890 270.2575 294.2823 312.1609 333.1066 375.2796 383.2296 393.7406 452.3011 472.4405 515.7508 530.9708 556.4663 560.5513 563.4501 596.0990 620.0273 662.7283 704.9565 718.4075 793.8762 807.3169 832.6050 856.0410 862.3702 904.0590 939.0525 944.4889 948.1571 954.8683 982.5781 992.3333 1003.4453 1021.4471 1032.4373 1054.0507 1073.1337 1091.7891 1096.8661 1113.1759 1135.7184 1141.0506 1152.7501 1158.2244 1177.3197 1182.2647 1205.0838 1215.3708 1224.1408 1229.1606 1240.4371 1248.9401 1267.0788 1286.4280 1298.3529 1303.0594 1312.6002 1337.6760 1382.6991 1387.3705 1388.1996 1402.5555 1411.4072 1439.1735 1445.8799 1454.3655 1461.0875 1467.7828 1470.2853 1472.8502 1474.1094 1477.9835 1481.5122 1484.5125 1488.9986 1490.4890 1498.9850 1505.0694 1603.3997 1658.7874 2820.4436 2841.5471 2951.8273 2961.7372 2969.6194 2974.9725 2978.3098 2981.6001 3001.5119 3017.0353 3039.8058 3044.1141 3044.8752 3057.2006 3060.0034 3063.1757 3073.5876 3076.0668 3077.3049 3083.4214 3093.8072 3116.0993 3118.9502 3420.6270
redmass: 2.7540 3.6710 3.0437 1.6233 3.5801 3.8840 1.2466 1.7486 1.5545 2.1919 1.6052 2.0105 1.8793 1.5406 2.2938 2.6586 2.2932 2.7316 2.6219 2.4601 3.0524 2.7233 2.4788 2.8194 3.5771 3.3911 3.4935 4.5469 3.3501 4.0443 3.3663 3.0216 3.9354 1.6609 3.5131 2.2661 3.2172 3.0475 2.0643 2.1436 2.6638 2.8139 1.8801 1.4733 2.0146 2.7893 1.5230 1.9432 1.5460 2.4188 2.3693 1.3727 1.2364 1.2388 1.6837 2.2978 2.0708 1.4294 2.1964 2.1366 2.1768 1.9560 1.3895 1.8166 2.0279 1.4716 2.2986 3.5318 2.2454 1.7399 1.5185 1.4579 2.3747 1.6011 1.2083 1.4216 1.9699 1.1957 1.1727 1.4628 1.1566 1.0684 1.0632 1.0495 1.0591 1.0657 1.0571 1.0738 1.0560 1.0797 1.0523 1.0596 1.0588 1.2071 5.8100 11.5651 1.0718 1.0780 1.0836 1.0404 1.0368 1.0368 1.0372 1.0360 1.0602 1.0623 1.0973 1.1017 1.0882 1.0990 1.1030 1.0979 1.0988 1.0984 1.0989 1.1041 1.0969 1.0957 1.0973 1.0746
irintensity: 0.7037 1.8956 1.7030 0.1405 0.1819 2.5914 0.2647 0.8233 0.6055 6.2567 1.6106 1.7024 1.1277 1.9588 1.1727 7.8505 2.1810 0.4440 1.7206 14.9461 12.0988 0.1908 0.2593 8.7571 3.0007 1.1454 1.5509 4.4599 6.7711 2.0296 11.2469 8.1204 10.0222 56.3457 13.4614 10.3184 23.2179 3.7210 3.3857 0.9747 0.4278 3.7874 5.3658 0.2002 2.9851 1.4087 4.5664 0.5701 31.7700 0.3852 77.8034 6.6228 1.0047 4.5048 26.1955 84.8952 38.6845 2.3556 30.3570 20.5405 11.8939 4.5801 1.5305 2.4484 3.5815 0.5530 1.8284 61.1685 12.1389 2.4569 2.5853 9.0556 10.3641 4.8266 13.5977 28.0936 139.5984 19.9711 43.8805 36.7285 28.0597 9.5538 3.0356 6.9645 2.5995 17.8000 13.0425 23.5316 4.0770 20.5926 35.9003 3.4576 6.4059 15.0544 227.8182 160.4623 101.3336 66.2550 39.6098 48.5871 100.4463 23.2153 35.6588 39.5877 28.3225 44.7131 48.4294 23.2955 38.1503 5.2422 3.1156 63.2967 21.0603 23.3716 17.8542 48.7795 28.9900 19.0148 1.0145 53.0563
temp: 298.150 k
press: 1.00000 atm
elementType: 8 8 7 7 6 6 6 6 6 6 6 6 6 6 6 6 6 6 1 1 1 1 1 1 1 1 1 1 1 1 1 1 1 1 1 1 1 1 1 1 1 1
symmnumber: 1
zpe: 947659.9 jmol-1
zpe.correction: 0.360945 hartree
zpe.thermalcorrener: 0.381057 hartree
zpe.thermalcorrenthalpy: 0.382001 hartree
zpe.thermalcorrgfe: 0.312171 hartree
zpe.sumelectzpe: -806.405999 hartree
zpe.sumelectthermal: -806.385887 hartree
zpe.sumelectthermalent: -806.384943 hartree
zpe.sumelectthermalfe: -806.454773 hartree
dipole: -1.4710 -6.4663 -0.2046
dipole: 6.6346
quadrupole: -86.4596 -119.8828 -109.8659
quadrupole: 9.5702 2.7358 3.0030
quadrupole: 18.9431 -14.4800 -4.4631 9.5702 2.7358 3.0030
hfenergy: -806.7669438 hartree
pointgroup: C01 [X(C14H24N2O2)]
dipole: 0.6010935 2.5362573 -0.1399209 debye
polarizability: 203.191288|4.9546588|160.4632545|-1.8770569|-0.8780482|134.5710533 unknown
InChI: InChI=1S/C14H24N2O2/c1-13(2)9-6-7-14(13,3)12(18)11(9)15-8-10(17)16(4)5/h9,11,15H,6-8H2,1-5H3
charge 0 multiplicity 1
42 atoms
O  -1.261981 -2.310494 -0.585195
O  3.240065 -1.608634 0.040454
N  0.855802 -0.358072 0.115905
N  4.50137 0.334786 -0.206159
C  -2.667632 1.003381 -0.276411
C  -2.766814 -0.487813 0.244139
C  -1.198503 1.20634 0.258751
C  -2.365154 -0.319576 1.767629
C  -0.428238 0.036612 -0.44468
C  -1.302585 0.834819 1.765187
C  -1.478956 -1.10186 -0.331503
C  -2.829227 1.125435 -1.814838
C  -3.687852 1.967064 0.3723
C  -4.03769 -1.294091 -0.0028
C  1.99776 0.481808 -0.225535
C  3.295744 -0.34724 -0.114434
C  5.762459 -0.413334 -0.061295
C  4.623622 1.788446 -0.388611
H  -0.770582 2.203733 0.056892
H  -1.970393 -1.261766 2.186402
H  -3.270484 -0.05583 2.344398
H  -0.335492 0.293438 -1.531445
H  -1.625712 1.692892 2.379358
H  -0.320563 0.488461 2.130079
H  -3.898019 1.055336 -2.090314
H  -2.297983 0.341262 -2.381815
H  -2.46163 2.107883 -2.167375
H  -3.638956 1.979681 1.473243
H  -4.719811 1.694139 0.081892
H  -3.507234 3.000078 0.018064
H  -3.899043 -2.338375 0.330212
H  -4.895546 -0.866214 0.547573
H  -4.295129 -1.327027 -1.07728
H  1.077192 -1.363271 0.047774
H  2.057381 1.366253 0.443175
H  1.929834 0.884035 -1.271623
H  5.516486 -1.470189 0.121592
H  6.351748 -0.020646 0.789641
H  6.372167 -0.334223 -0.981705
H  4.871554 2.300091 0.563284
H  3.695703 2.222323 -0.789331
H  5.432022 2.000761 -1.112795
