program: Gaussian 09
title: 000031418
version: EM64L-G09RevD.01
frameworkgroup: C1[X(C15H10BrNO2)]
method: RPBEPBE
basis: SDD
operation: Freq
keyword: #p
keyword: freq=noraman
keyword: PBEPBE/SDD
title: #p freq=noraman PBEPBE/SDD
converged: NO YES NO NO
title: Mulliken charges:
elementType: Br O O N C C C C C C C C C C C C C C C H H H H H H H H H H
charge: 0.062285 -0.311337 -0.177352 -0.388493 0.088031 0.424764 0.287837 0.267544 -0.108992 0.277145 -0.235499 -0.433784 -0.373510 -0.377573 -0.380846 -0.173029 -0.227902 -0.228107 -0.648713 0.253548 0.291862 0.293430 0.255378 0.378215 0.238357 0.239267 0.233785 0.233253 0.240439
chargesum: 0.00000
title: Mulliken charges with hydrogens summed into heavy atoms:
elementType: Br O O N C C C C C C C C C C C C C C C
charge: 0.062285 -0.311337 -0.177352 -0.010278 0.088031 0.424764 0.287837 0.267544 -0.108992 0.277145 -0.235499 -0.433784 -0.119962 -0.085711 -0.087416 0.082349 0.010455 0.011159 0.058764
polarizability: 3.05829047e+02 -2.12523824e+01 2.74048735e+02 -2.14458992e-02 7.61341107e-02 7.43196744e+01
1716.lowfreq: -7.7129 -2.7094 -0.0005 -0.0003 0.0002 7.9445 23.9514 53.3204 74.2113
frequency: 23.8625 53.3050 74.2050 116.9814 138.7329 161.0482 170.9611 178.3874 183.7772 231.5268 249.7498 304.8126 322.1212 323.5069 364.1779 379.5542 420.1369 422.2190 425.7477 471.0803 496.9085 498.5997 558.4923 611.7604 625.2983 661.3208 669.9380 698.7713 730.7791 732.3471 784.5439 807.4847 821.6158 848.6801 864.6916 874.2487 906.0467 934.6873 966.0768 979.8493 997.2464 1014.4421 1034.2201 1087.2518 1095.0078 1112.3681 1114.2294 1154.8651 1166.3638 1170.7029 1190.3418 1241.8950 1274.9637 1294.0644 1321.8116 1366.5110 1383.2717 1392.0854 1404.5852 1439.5594 1445.8935 1471.3275 1474.7622 1485.6938 1499.8810 1518.8373 1549.7715 1575.4486 1598.0016 1610.5542 1614.6132 2957.8127 3028.1750 3105.1909 3137.2564 3153.7355 3157.0716 3166.5321 3169.3800 3174.6175 3179.6776
redmass: 10.6042 5.8212 3.7179 4.4970 11.4017 1.9396 4.7261 3.5903 1.8407 11.2533 5.1838 5.9915 5.0856 5.0875 8.9378 6.9202 3.5741 12.5078 5.0700 11.2135 6.8800 4.3506 4.0287 5.0002 7.4171 4.4261 5.4694 7.5995 2.3110 4.7274 7.2856 1.8013 1.6593 6.8872 2.7680 1.1234 6.4348 1.9522 1.3379 6.2385 1.3909 1.3614 2.0163 2.6680 2.2902 1.2889 3.4034 1.9781 1.9886 1.1751 1.3976 1.7436 2.7145 2.3095 2.8778 5.5703 3.8870 4.2228 9.1453 1.3156 2.5084 2.7862 1.0420 1.2375 3.7869 3.8098 7.7663 3.0549 3.9310 6.3809 7.3453 1.0379 1.1007 1.0965 1.0864 1.0906 1.0878 1.0946 1.0829 1.0996 1.0966
irintensity: 3.6625 3.4922 0.5151 0.0535 0.4343 0.2500 0.7879 0.4836 0.0396 1.0363 0.0609 4.0143 2.7598 1.1542 4.2649 4.1846 0.8397 16.4712 0.2879 0.4671 2.0539 3.4444 27.4295 4.3819 19.5268 0.4348 14.5836 2.3905 27.7001 3.0023 31.4918 59.8885 44.2629 3.7258 0.6644 87.2069 6.4179 0.0652 0.0063 49.7865 4.6556 0.0048 5.0263 1.3604 7.0612 2.6139 45.6705 4.5642 0.3248 9.8662 24.8622 9.9154 329.6227 22.3840 325.1820 18.1107 51.7189 5.3315 19.7979 51.4327 6.2062 8.0627 15.0142 1.4600 97.4306 137.1543 162.6937 34.6065 111.9417 24.8597 86.9194 117.1299 38.9036 19.0087 4.3350 10.8453 2.6684 2.7009 61.7939 28.5525 10.5230
temp: 298.150 k
press: 1.00000 atm
elementType: 35 8 8 7 6 6 6 6 6 6 6 6 6 6 6 6 6 6 6 1 1 1 1 1 1 1 1 1 1
symmnumber: 1
zpe: 552782.7 jmol-1
zpe.correction: 0.210544 hartree
zpe.thermalcorrener: 0.226164 hartree
zpe.thermalcorrenthalpy: 0.227108 hartree
zpe.thermalcorrgfe: 0.166260 hartree
zpe.sumelectzpe: -794.976411 hartree
zpe.sumelectthermal: -794.960791 hartree
zpe.sumelectthermalent: -794.959847 hartree
zpe.sumelectthermalfe: -795.020694 hartree
dipole: 0.3867 4.2500 -0.0400
dipole: 4.2677
quadrupole: -101.9452 -104.9978 -122.3507
quadrupole: -17.4171 -0.0382 0.0053
quadrupole: 7.8194 4.7668 -12.5861 -17.4171 -0.0382 0.0053
hfenergy: -795.1869547 hartree
pointgroup: C01 [X(C15H10Br1N1O2)]
dipole: 0.8606969 1.4401367 0.0662879 debye
polarizability: 314.9574135|-8.697482|264.7376996|4.3761801|4.2692795|74.5023425 unknown
InChI: InChI=1S/C15H10BrNO2/c1-17-11-7-6-10(16)12-13(11)15(19)9-5-3-2-4-8(9)14(12)18/h2-7,17H,1H3
charge 0 multiplicity 1
29 atoms
Br 1.578274 -3.908008 -0.029647
O  -0.003002 2.621287 0.079924
O  -1.113512 -2.779927 -0.071226
N  2.523819 2.19308 0.129277
C  0.878983 0.365339 0.0522
C  0.609051 -1.059904 0.014008
C  -1.623143 0.862566 0.018469
C  -1.909543 -0.527157 -0.019961
C  -0.219865 1.342001 0.051336
C  2.249564 0.849941 0.092654
C  -0.816507 -1.545469 -0.029271
C  1.705938 -1.955058 0.018279
C  3.31545 -0.108645 0.093705
C  -2.684432 1.803119 0.024143
C  -3.257267 -0.966723 -0.052179
C  3.042747 -1.472904 0.058522
C  -4.019961 1.360017 -0.007472
C  -4.307574 -0.029593 -0.045702
C  3.869573 2.762174 0.176067
H  4.354274 0.229623 0.122921
H  -2.431422 2.866842 0.053516
H  -3.447692 -2.04375 -0.082139
H  3.866696 -2.19246 0.061421
H  1.672808 2.794788 0.11923
H  -4.838793 2.087329 -0.002743
H  -5.347506 -0.372079 -0.070395
H  4.463783 2.503321 -0.722704
H  4.431281 2.427409 1.070167
H  3.783879 3.859141 0.221999
