program: Gaussian 09
title: 000031288
version: EM64L-G09RevD.01
frameworkgroup: C1[X(C10H20O4)]
method: RPBEPBE
basis: SDD
operation: Freq
keyword: #pfreq=noraman
keyword: PBEPBE/SDD
title: #p freq=noraman PBEPBE/SDD
converged: NO YES NO NO
title: Mulliken charges:
elementType: O O O O C C C C C C C C C C H H H H H H H H H H H H H H H H H H H H
charge: -0.283136 -0.287510 -0.268181 -0.243839 -0.370897 -0.242565 -0.347094 -0.260776 -0.262926 -0.685429 -0.254207 -0.277883 0.293691 -0.747465 0.206102 0.206227 0.182618 0.182871 0.192546 0.192686 0.199048 0.199024 0.203628 0.203846 0.211567 0.216184 0.211594 0.202112 0.202173 0.241738 0.241753 0.247860 0.246607 0.248034
chargesum: 0.00000
title: Mulliken charges with hydrogens summed into heavy atoms:
elementType: O O O O C C C C C C C C C C
charge: -0.283136 -0.287510 -0.268181 -0.243839 0.041431 0.122923 0.038139 0.137296 0.144548 -0.046085 0.150077 0.205609 0.293691 -0.004963
polarizability: 1.76787948e+02 -1.67719487e-01 1.10270673e+02 2.37877415e-02 4.08964772e-03 9.33281585e+01
1716.lowfreq: -34.6496 -2.8479 -0.0010 -0.0006 0.0003 3.5211 12.5339 18.5133 30.8644
frequency: -34.3983 17.1863 30.8642 33.7025 39.7520 59.0858 74.4677 80.3835 101.8672 112.2673 125.1469 141.2672 151.0612 169.4489 185.9475 229.3772 231.9625 308.3204 334.7674 412.4794 431.8331 494.9920 511.0425 564.5441 617.8686 742.3251 807.4950 814.8436 826.6718 833.3543 887.5057 917.8631 937.5502 948.5353 961.0885 1008.4079 1024.5812 1041.5732 1058.5547 1074.7296 1082.7762 1095.5303 1097.8833 1115.9568 1117.0093 1135.8550 1148.6551 1168.9272 1179.7592 1205.5383 1211.3619 1250.8222 1254.4256 1269.4763 1272.6723 1283.9758 1302.2110 1325.9953 1346.8391 1366.2441 1382.0468 1391.5657 1399.7330 1424.2968 1453.3281 1454.9344 1470.3111 1473.5966 1476.2233 1477.5700 1480.3546 1484.3389 1489.3595 1494.7845 1497.3200 1655.7625 2910.3398 2940.3576 2942.8155 2951.4614 2957.7151 2967.4571 2976.0952 2984.6706 2992.3088 2997.2366 3008.5536 3010.3995 3017.3047 3028.3884 3055.1272 3074.4441 3075.3887 3096.3022 3100.4630 3144.6146
redmass: 1.0711 4.4720 4.5948 3.0224 3.1539 1.9541 2.6930 4.5075 2.2183 2.9210 2.1751 3.0046 4.1685 5.5456 2.9703 1.1311 4.0083 4.1426 3.8459 3.3307 3.9362 3.1746 4.8965 3.0027 4.7905 1.0734 1.1264 1.1001 6.7711 1.1010 2.7166 3.1933 1.1461 4.0482 4.6914 2.4687 4.5714 1.6640 5.2051 8.4173 2.3512 3.0797 1.4304 2.6735 1.4569 2.7820 1.3958 1.1646 1.1742 3.6862 1.3702 1.1350 1.1499 1.2836 1.1566 1.0860 1.2085 1.2864 1.4796 1.4310 1.2521 1.2300 1.4671 1.5766 1.0620 1.0470 1.0756 1.0691 1.0790 1.0419 1.0731 1.0794 1.0854 1.0817 1.0799 9.4649 1.0547 1.0556 1.0551 1.0544 1.1057 1.0587 1.0365 1.1049 1.0593 1.1069 1.0368 1.1005 1.1102 1.0571 1.1039 1.1011 1.0994 1.0974 1.1091 1.1009
irintensity: 0.6966 0.0084 0.6306 2.7399 0.3896 0.8825 0.0183 0.2981 0.8784 4.5988 2.1910 8.9855 0.2098 0.4156 14.8252 0.1136 9.2228 5.6787 9.6944 0.9209 9.6332 3.5141 0.7387 2.9250 6.0337 9.1516 0.3087 0.5249 33.4701 1.0229 17.6333 8.1927 0.6846 10.6648 0.7381 115.6657 1.1766 9.7860 17.4793 413.0130 3.6356 28.9685 0.0378 1.3516 0.0525 1.1641 1.2118 1.1099 12.7542 347.7364 0.4228 0.0313 0.0281 0.3668 0.0784 0.0680 9.2438 11.0522 1.6768 5.0050 45.5273 15.0758 16.7664 0.0690 28.2999 18.3934 1.1917 0.1564 2.2513 12.7549 5.5952 14.8763 10.6550 0.6707 10.3632 202.5395 53.5208 37.0857 29.1711 103.1325 51.5377 37.8228 32.3347 1.2960 44.8529 49.8987 2.5513 6.5428 97.8269 15.5406 27.1373 100.5935 52.3157 7.1096 30.5719 10.5095
temp: 298.150 k
press: 1.00000 atm
elementType: 8 8 8 8 6 6 6 6 6 6 6 6 6 6 1 1 1 1 1 1 1 1 1 1 1 1 1 1 1 1 1 1 1 1
symmnumber: 1
zpe: 761504.4 jmol-1
zpe.correction: 0.290042 hartree
zpe.thermalcorrener: 0.307765 hartree
zpe.thermalcorrenthalpy: 0.308709 hartree
zpe.thermalcorrgfe: 0.240251 hartree
zpe.sumelectzpe: -692.762819 hartree
zpe.sumelectthermal: -692.745097 hartree
zpe.sumelectthermalent: -692.744152 hartree
zpe.sumelectthermalfe: -692.812610 hartree
dipole: 1.2693 -1.7417 -0.0042
dipole: 2.1552
quadrupole: -80.1504 -90.4295 -83.8958
quadrupole: 19.3130 -0.0215 0.0059
quadrupole: 4.6749 -5.6043 0.9294 19.3130 -0.0215 0.0059
hfenergy: -693.0528612 hartree
pointgroup: C01 [X(C10H20O4)]
dipole: -0.5031538 0.6824322 0.0095911 debye
polarizability: 176.7875377|0.2002827|110.266964|-0.1413872|0.2562622|93.3322775 unknown
InChI: InChI=1S/C10H20O4/c1-3-4-5-12-6-7-13-8-9-14-10(2)11/h3-9H2,1-2H3
charge 0 multiplicity 1
34 atoms
O  -2.815489 0.268248 0.006831
O  0.817273 -0.255245 -0.008199
O  4.399559 0.546497 -0.004572
O  5.745886 -1.35521 -0.037011
C  -5.241562 0.318039 0.00652
C  -4.008591 -0.589522 -0.006818
C  -6.564378 -0.48311 -0.004241
C  -1.571289 -0.505236 -0.011174
C  -0.433374 0.513566 0.005903
C  -7.807933 0.431763 0.006963
C  1.999679 0.60833 0.002741
C  3.199353 -0.335031 -0.01372
C  5.639032 -0.109545 -0.019623
C  6.767938 0.897632 -0.003176
H  -5.199653 0.989479 -0.872857
H  -5.198977 0.964316 0.904536
H  -4.001187 -1.231702 -0.917212
H  -4.001797 -1.259152 0.883549
H  -6.593803 -1.135913 -0.900574
H  -6.594503 -1.158531 0.875126
H  -1.508359 -1.135022 -0.92458
H  -1.503442 -1.169713 0.876984
H  -0.497486 1.174994 -0.883908
H  -0.49687 1.143152 0.918561
H  -7.817431 1.096895 -0.876808
H  -8.743116 -0.157358 -0.002017
H  -7.819331 1.072664 0.908441
H  2.016221 1.244485 0.913487
H  2.013267 1.2716 -0.888497
H  3.214093 -0.991516 0.873218
H  3.208951 -0.966209 -0.91894
H  6.697832 1.562637 -0.881319
H  7.732634 0.370958 -0.011691
H  6.697855 1.533962 0.895977
