program: Gaussian 09
title: 000031245
version: EM64L-G09RevD.01
frameworkgroup: C1[X(C6H12O)]
method: RPBEPBE
basis: SDD
operation: Freq
keyword: #pfreq=noraman
keyword: PBEPBE/SDD
title: #p freq=noraman PBEPBE/SDD
converged: YES YES NO NO
title: Mulliken charges:
elementType: O C C C C C C H H H H H H H H H H H H
charge: -0.183061 -0.374521 -0.104325 -0.353976 -0.712330 -0.689555 -0.081093 0.188464 0.204040 0.231705 0.213586 0.201109 0.226674 0.210106 0.234477 0.221208 0.208657 0.209742 0.149093
chargesum: 0.00000
title: Mulliken charges with hydrogens summed into heavy atoms:
elementType: O C C C C C C
charge: -0.183061 0.017983 0.127379 0.060719 -0.041072 -0.049947 0.068000
polarizability: 7.29957999e+01 -1.74860174e+00 6.94312742e+01 -9.08651392e-01 1.70509438e+00 5.84074206e+01
1716.lowfreq: -17.2275 -11.8774 -4.5635 -0.0011 -0.0009 -0.0008 48.7801 64.8120 95.6951
frequency: 48.4352 64.3426 95.6874 160.4429 205.2410 226.7624 282.4626 326.4804 344.7292 411.4028 537.8372 727.8704 826.3832 863.4454 892.1317 927.1874 958.3719 1006.2215 1032.8284 1066.4817 1111.7831 1142.5368 1161.4198 1220.9242 1261.7894 1285.9438 1304.5529 1309.8618 1347.7249 1381.1491 1388.4457 1390.4075 1459.9237 1471.4725 1475.1501 1477.1289 1478.2410 1484.9772 1646.5764 2824.1075 2956.2684 2973.4963 2974.7884 2977.3390 3003.5865 3020.7617 3035.2083 3069.5473 3073.9172 3075.4059 3085.2068
redmass: 3.9428 1.8828 2.3957 2.4592 1.0611 1.1073 2.2121 2.4139 3.0052 3.0477 3.6019 1.1166 1.4984 1.4933 1.5820 1.9249 1.8952 1.3858 2.0591 2.7046 2.1975 2.2187 2.0725 1.3986 1.2461 1.1890 1.3485 1.3138 1.5253 1.1814 1.2127 1.2188 1.0729 1.0617 1.0493 1.0487 1.0497 1.0758 7.9684 1.0833 1.0605 1.0362 1.0600 1.0353 1.0956 1.0899 1.1002 1.1008 1.0988 1.0992 1.1004
irintensity: 6.5507 1.1427 0.3707 0.4801 0.2391 0.0378 2.1704 2.6364 4.3582 0.2839 4.7580 13.0566 8.8311 5.4250 17.7165 6.4534 13.6647 1.5023 5.6705 1.8733 3.6809 0.7275 4.2473 1.3392 0.6505 0.7246 0.8296 0.0879 0.9706 6.6989 4.6573 9.7148 0.6471 0.9014 14.5868 23.3932 0.6327 14.6203 162.7579 110.1764 17.3353 48.6639 26.0519 31.4476 6.2371 5.4896 32.4848 60.9983 60.1971 47.5429 28.0670
temp: 298.150 k
press: 1.00000 atm
elementType: 8 6 6 6 6 6 6 1 1 1 1 1 1 1 1 1 1 1 1
symmnumber: 1
zpe: 435885.6 jmol-1
zpe.correction: 0.166020 hartree
zpe.thermalcorrener: 0.175305 hartree
zpe.thermalcorrenthalpy: 0.176249 hartree
zpe.thermalcorrgfe: 0.131313 hartree
zpe.sumelectzpe: -310.462870 hartree
zpe.sumelectthermal: -310.453585 hartree
zpe.sumelectthermalent: -310.452641 hartree
zpe.sumelectthermalfe: -310.497577 hartree
dipole: -1.4930 2.8523 0.6806
dipole: 3.2906
quadrupole: -47.6129 -49.9645 -43.2501
quadrupole: 6.1518 1.4695 -1.4394
quadrupole: -0.6704 -3.0220 3.6924 6.1518 1.4695 -1.4394
hfenergy: -310.6288898 hartree
pointgroup: C01 [X(C6H12O1)]
dipole: -0.6513714 1.0927263 0.2401673 debye
dipolederiv: -0.4445421 0.2758504 0.0240706 0.3015839 -0.7709791 -0.052066 0.0663644 -0.1208028 -0.4492737 0.0748108 -0.0702372 0.0222946 -0.026833 0.0570214 -0.0211138 -0.0343187 0.0273987 0.1462536 -0.070712 0.1015738 -0.0201436 0.1305547 -0.2835746 0.0679092 -0.0803293 0.1020599 0.0355504 0.031759 -0.0183105 0.0191253 0.0024499 0.0854846 -0.0273436 0.0395496 -0.0217793 0.1474715 -0.0143811 0.0362302 -0.0304974 -0.0293882 0.0297693 -0.0098808 -0.020182 0.0816694 0.0770242 -0.0711454 -0.0082992 0.0244115 -0.0390057 0.0707283 -0.0125426 0.0062134 -0.0156461 0.0880217 0.2978224 -0.4796325 -0.0159166 -0.5247795 0.9097486 0.0550537 0.0708009 -0.0678887 0.7556159 0.0414201 -0.0221368 -0.0152443 -0.0209923 0.0573949 -0.0275881 0.0188717 -0.0645187 -0.1773508 0.0024004 0.0831842 -0.0310255 0.0574478 -0.1225309 0.0702262 -0.028722 0.086732 0.0372545 0.0395902 -0.0047061 -0.0112758 0.0119403 0.0258639 -0.0579338 -0.0022983 -0.02948 -0.1324601 -0.0078628 0.0790776 -0.040132 0.0703282 -0.1069564 0.0651838 -0.0456808 0.0889044 0.0331447 0.028293 -0.0026182 0.0481124 -0.0106544 0.0583655 -0.0251258 0.023287 -0.0596343 -0.1748213 0.0614211 0.0722814 -0.0588675 0.0521648 -0.0951168 0.0815896 -0.0503424 0.0806703 0.0441416 0.0862832 -0.003066 0.0323404 -0.0262713 0.0778281 -0.0079242 -0.0190977 -0.0800487 -0.1527619 -0.1575322 -0.0322305 0.0601356 0.0122637 0.0724476 -0.0211207 0.0699827 -0.0066131 0.0793443 -0.0721288 -0.1153684 -0.0268003 -0.1549633 -0.0606937 -0.0504815 -0.0396066 -0.0564518 0.0827126 0.0349316 0.0538613 -0.0142599 0.1193562 -0.0962039 0.0964995 -0.0377666 0.1035117 0.0335501 0.0646584 0.0046096 -0.009878 0.0253961 0.0867559 -0.0420312 0.057198 -0.0349285 -0.1780977 0.0749144 0.0499368 0.0435505 0.049402 0.0046474 -0.0813097 0.0060766 -0.0131543 -0.2953198 unknown
polarizability: 73.1929034|-1.5659268|69.311936|-0.8819094|1.4040262|58.3296554 unknown
InChI: InChI=1S/C6H12O/c1-3-4-6(2)5-7/h5-6H,3-4H2,1-2H3
charge 0 multiplicity 1
19 atoms
O  1.894809 -1.672187 -0.062936
C  -0.733305 0.703123 0.119995
C  0.747285 0.507206 -0.315631
C  -1.660882 -0.471886 -0.266462
C  1.590249 1.777326 -0.014068
C  -3.128867 -0.224074 0.14077
C  1.355062 -0.662107 0.446494
H  -0.772808 0.863348 1.218763
H  -1.110892 1.637692 -0.342258
H  0.792586 0.275231 -1.396527
H  -1.298447 -1.406604 0.206658
H  -1.599453 -0.638781 -1.360568
H  1.16274 2.648548 -0.542505
H  1.590301 2.006127 1.068793
H  2.638047 1.655951 -0.341274
H  -3.774095 -1.074697 -0.144419
H  -3.530329 0.683457 -0.34866
H  -3.220089 -0.08328 1.234408
H  1.296388 -0.54549 1.564627
