program: Gaussian 09
title: 000031270
version: EM64L-G09RevD.01
frameworkgroup: C1[X(C18H37NO2)]
method: RPBEPBE
basis: SDD
operation: Freq
keyword: #p
keyword: freq=noraman
keyword: PBEPBE/SDD
title: #p freq=noraman PBEPBE/SDD
converged: YES YES NO NO
title: Mulliken charges:
elementType: O O N C C C C C C C C C C C C C C C C C C H H H H H H H H H H H H H H H H H H H H H H H H H H H H H H H H H H H H H
charge: -0.456653 -0.471846 -0.604755 -0.384770 -0.386558 -0.386201 -0.384135 -0.383971 -0.382388 -0.375180 -0.372438 -0.380313 -0.353505 -0.462456 -0.356494 -0.199683 -0.128310 -0.042390 -0.264705 -0.696751 -0.384768 0.194274 0.192837 0.193874 0.193344 0.194494 0.193417 0.193251 0.192515 0.191965 0.195681 0.191790 0.192002 0.197003 0.191414 0.189412 0.189063 0.196351 0.210262 0.187577 0.187583 0.211874 0.201969 0.194762 0.194588 0.225220 0.186765 0.208935 0.260603 0.209611 0.209677 0.214966 0.194903 0.249162 0.292192 0.250174 0.338960 0.345799
chargesum: 0.00000
title: Mulliken charges with hydrogens summed into heavy atoms:
elementType: O O N C C C C C C C C C C C C C C C C C C
charge: -0.117693 -0.126047 -0.062388 0.002341 0.000660 0.001710 0.001631 0.003675 0.001405 0.013238 0.006037 0.026300 0.021655 -0.048613 0.032856 0.025537 0.058455 0.166545 -0.004102 -0.062497 0.059297
polarizability: 3.02659122e+02 2.03587206e+00 1.76001828e+02 9.32306087e+00 -1.46596048e+00 1.76110446e+02
1716.lowfreq: -8.8689 -4.5052 -2.1441 -0.0020 0.0009 0.0016 5.5148 16.0790 19.9999
frequency: 3.7956 14.7195 19.9741 31.5457 36.3288 43.1371 47.0082 59.7057 65.9030 76.1146 82.5318 92.5082 105.2509 119.1967 121.7299 131.4781 134.9851 149.3581 151.5563 153.4302 183.3950 210.1122 220.8573 226.0789 230.9338 245.7553 275.4501 289.7026 297.7444 313.4053 322.1658 351.8054 374.8929 405.6674 437.9516 452.3913 483.4473 498.7045 511.9269 542.3229 629.1319 687.3301 720.1708 720.9356 723.2903 729.9331 744.2957 768.8280 801.9503 825.3920 851.6633 854.6745 887.2091 896.5292 915.4153 942.1534 966.7421 974.9631 977.4083 982.0056 988.1391 993.0237 1002.3370 1017.1113 1025.1891 1029.4513 1033.2225 1044.2895 1058.1404 1072.6123 1077.0261 1080.4576 1081.4768 1085.9321 1092.5227 1108.3993 1122.7942 1144.5557 1160.6482 1180.1124 1182.4263 1196.4051 1196.8324 1215.6553 1221.2042 1229.2804 1234.3357 1244.4537 1248.0458 1257.2852 1263.7757 1270.8831 1274.9848 1278.3917 1282.2649 1287.2548 1290.2628 1291.0700 1294.1091 1296.8572 1297.9499 1309.3532 1319.8752 1330.0342 1337.8062 1344.9139 1348.3757 1351.9192 1352.7612 1356.1566 1356.5380 1383.4165 1387.5255 1412.4673 1455.8155 1459.1901 1459.4602 1459.7847 1461.5962 1462.5394 1463.9302 1466.6047 1470.9558 1475.6057 1476.8150 1480.0679 1484.1402 1487.4733 1489.4403 1631.6192 1675.1417 2874.1840 2936.9281 2947.7980 2947.8633 2949.2014 2949.6305 2950.5924 2951.9871 2953.4142 2955.1621 2959.0785 2962.9392 2966.8753 2967.5011 2970.8548 2979.2023 2980.6142 2982.8168 2986.0719 2990.7394 2996.9278 3003.7768 3010.9220 3018.0698 3026.0620 3033.8644 3040.2967 3044.4156 3058.9328 3063.0727 3067.4315 3069.5483 3090.4999 3442.5384 3557.7290 3569.4444 3582.8419
redmass: 4.3228 4.2143 4.0230 1.8598 4.0294 3.7577 2.5402 2.0259 3.5487 2.2615 3.9131 1.9887 2.2616 2.7322 2.2816 2.8818 2.2019 2.1984 2.2090 2.6362 3.0891 2.9482 3.5048 2.6294 1.1113 1.2472 2.5940 1.3103 1.8909 1.8119 3.1589 2.7172 3.1810 3.2418 3.2308 3.0975 2.7747 3.0274 2.9341 2.9309 2.5777 1.6241 1.0599 1.0609 1.0745 1.0965 1.1313 1.1779 1.2731 1.6567 1.6412 2.3043 1.9046 1.2933 2.6234 1.2937 4.9759 3.5236 1.2968 2.5460 1.5894 2.0746 3.1677 1.7013 2.4567 1.6091 3.3685 1.5712 2.9067 2.6311 2.3444 2.1688 2.1794 2.5903 2.4288 1.9689 2.8687 1.8471 1.1416 1.6463 1.3776 1.3485 1.4716 1.4039 1.3409 1.2926 1.2955 1.3161 1.2520 1.2407 1.2382 1.2798 1.1234 1.0699 1.0743 1.1588 1.0997 1.2707 1.1908 1.1053 1.1329 1.3037 1.3538 1.3568 1.3499 1.4795 1.5101 1.5900 1.7191 1.6513 1.6283 1.5703 1.2173 1.6094 1.0832 1.0732 1.0801 1.0736 1.0695 1.0736 1.0637 1.0826 1.0859 1.0867 1.0426 1.0890 1.0926 1.0948 1.0955 1.0954 6.6254 1.0810 1.0852 1.0584 1.0584 1.0587 1.0590 1.0593 1.0596 1.0614 1.0595 1.0593 1.0590 1.0595 1.0591 1.0364 1.0600 1.0959 1.0965 1.0976 1.0991 1.1005 1.1013 1.1016 1.1029 1.1040 1.1042 1.1038 1.1033 1.0928 1.1035 1.1007 1.0993 1.0895 1.0448 1.0662 1.0968 1.0666
irintensity: 0.0643 0.0481 0.0624 0.0571 0.0520 0.0910 0.1092 0.0124 0.5013 0.0663 0.1592 0.0898 0.0138 0.2620 0.0073 0.2669 0.0440 0.0175 0.1512 0.1873 1.5781 0.4961 5.6124 4.4437 0.0052 75.5908 2.8465 175.9171 7.8227 38.5942 30.8942 21.2592 2.5288 7.4732 10.6262 7.6118 8.5134 3.0231 4.0936 24.2030 46.5589 210.3659 14.6396 9.3948 4.2416 0.4627 2.3476 1.1270 3.0961 1.5832 3.9267 11.3692 5.0246 0.7517 42.7294 2.2955 39.3745 11.0616 51.9988 6.3637 15.4919 65.0199 4.5160 8.8453 16.2125 0.1251 1.2912 7.1075 2.5823 2.8272 0.9312 0.3212 0.0564 5.0037 24.1684 8.5623 11.3834 3.8675 2.0876 9.7659 25.9575 16.9330 4.6576 2.8201 0.1662 38.6790 5.6721 0.3329 0.5072 3.1252 0.7944 0.7932 0.2702 0.2848 0.0501 0.5164 0.6019 0.4466 0.9545 0.1011 0.2271 0.4785 3.5510 7.0710 7.8133 0.2140 6.8102 0.6596 0.3704 0.0578 0.1995 16.9848 11.1572 2.4293 3.0601 0.0262 8.2673 0.3370 0.1371 0.3989 0.0659 0.4567 1.0975 1.6308 12.3355 1.9117 3.5330 4.6732 41.1624 59.0824 14.4823 81.6320 48.5030 0.0019 0.0107 0.0319 0.4606 0.0947 0.5436 13.5223 2.8272 0.5218 53.9132 1.2052 364.4465 39.1470 61.9347 0.1600 0.2836 0.5818 0.5471 0.8213 1.0716 1.0600 0.6417 3.1847 3.6410 56.4896 306.8968 59.3877 34.9986 99.1351 55.5851 24.6506 5.7393 6.2320 2.3912 4.0215
temp: 298.150 k
press: 1.00000 atm
elementType: 8 8 7 6 6 6 6 6 6 6 6 6 6 6 6 6 6 6 6 6 6 1 1 1 1 1 1 1 1 1 1 1 1 1 1 1 1 1 1 1 1 1 1 1 1 1 1 1 1 1 1 1 1 1 1 1 1 1
symmnumber: 1
zpe: 1367674.4 jmol-1
zpe.correction: 0.520920 hartree
zpe.thermalcorrener: 0.549500 hartree
zpe.thermalcorrenthalpy: 0.550444 hartree
zpe.thermalcorrgfe: 0.455031 hartree
zpe.sumelectzpe: -911.512083 hartree
zpe.sumelectthermal: -911.483502 hartree
zpe.sumelectthermalent: -911.482558 hartree
zpe.sumelectthermalfe: -911.577971 hartree
dipole: -2.5305 -0.6227 -0.0590
dipole: 2.6067
quadrupole: -163.5314 -139.3791 -125.0264
quadrupole: -8.5482 3.1592 -3.7701
quadrupole: -20.8857 3.2665 17.6192 -8.5482 3.1592 -3.7701
hfenergy: -912.0330025 hartree
pointgroup: C01 [X(C18H37N1O2)]
dipole: 0.9959842 -0.2303845 0.0817024 debye
polarizability: 302.6703554|0.4935626|176.7039295|9.4526334|1.3308255|175.3971117 unknown
InChI: InChI=1S/C18H37NO2/c1-2-3-4-5-6-7-8-9-10-11-12-13-14-15-18(21)17(19)16-20/h14-15,17-18,20-21H,2-13,16,19H2,1H3
charge 0 multiplicity 1
58 atoms
O  -6.909718 1.469436 -1.33382
O  -9.759372 -1.481034 -0.612061
N  -9.119303 0.886653 0.785444
C  3.222273 0.281683 0.033921
C  4.554804 -0.481314 0.206778
C  1.977485 -0.568642 0.373916
C  5.796987 0.371864 -0.135436
C  0.649452 0.207064 0.223798
C  7.132012 -0.384307 0.048417
C  -0.599196 -0.640093 0.556916
C  8.372631 0.470683 -0.295622
C  -1.918082 0.157379 0.44964
C  9.709202 -0.281721 -0.107112
C  -3.174223 -0.699512 0.765001
C  10.948784 0.575193 -0.45192
C  -4.44866 0.115141 0.770414
C  -6.760943 0.788322 -0.021572
C  -8.071522 0.000131 0.242956
C  -5.522995 -0.083712 -0.038266
C  12.280013 -0.18346 -0.260977
C  -8.611167 -0.647747 -1.038516
H  3.141986 0.646722 -1.011526
H  3.233544 1.18638 0.677723
H  4.544856 -1.387633 -0.434623
H  4.636213 -0.843233 1.253268
H  1.956033 -1.465236 -0.28064
H  2.06504 -0.946252 1.4143
H  5.719156 0.727745 -1.184277
H  5.801898 1.282016 0.500699
H  0.672213 1.099442 0.884281
H  0.564973 0.592149 -0.813937
H  7.210891 -0.738303 1.097812
H  7.127807 -1.295379 -0.586279
H  -0.64131 -1.516326 -0.123368
H  -0.501991 -1.049217 1.584557
H  8.295354 0.821823 -1.346149
H  8.374497 1.383568 0.336638
H  -1.880861 1.020936 1.146093
H  -2.016425 0.582503 -0.569469
H  9.788653 -0.632398 0.943404
H  9.70954 -1.194718 -0.739144
H  -3.256597 -1.526293 0.032722
H  -3.032153 -1.169313 1.761744
H  10.868372 0.925411 -1.501443
H  10.947675 1.487054 0.180006
H  -4.482785 0.946721 1.495411
H  -6.65364 1.550252 0.78285
H  -7.803287 -0.832464 0.940259
H  -5.510954 -0.898474 -0.777766
H  12.396966 -0.520403 0.786501
H  12.321029 -1.080845 -0.907109
H  13.149528 0.452396 -0.510434
H  -7.832466 -1.276155 -1.515382
H  -8.928268 0.147469 -1.736701
H  -10.034987 0.422384 0.787421
H  -8.888903 1.290222 1.699597
H  -6.063201 1.949163 -1.521221
H  -10.251657 -1.788021 -1.413013
