program: Gaussian 09
title: 000031191
version: EM64L-G09RevD.01
frameworkgroup: C1[X(C6H11NO2)]
method: RPBEPBE
basis: SDD
operation: Freq
keyword: #p
keyword: freq=noraman
keyword: PBEPBE/SDD
title: #p freq=noraman PBEPBE/SDD
converged: NO YES NO NO
title: Mulliken charges:
elementType: O O N C C C C C C H H H H H H H H H H H
charge: -0.176843 -0.182448 -0.416467 -0.543339 -0.338669 0.274089 -0.684529 0.249700 -0.795393 0.230706 0.230348 0.224458 0.224899 0.226857 0.205496 0.205446 0.319548 0.233741 0.271435 0.240965
chargesum: 0.00000
title: Mulliken charges with hydrogens summed into heavy atoms:
elementType: O O N C C C C C C
charge: -0.176843 -0.182448 -0.096919 -0.082285 0.110688 0.274089 -0.046731 0.249700 -0.049251
polarizability: 1.02872875e+02 -9.28694940e-01 8.00961162e+01 2.69509151e-02 -5.34309671e-02 5.33842316e+01
1716.lowfreq: -14.3768 -7.0159 -0.0003 -0.0003 0.0002 6.3621 30.3549 35.7377 52.9330
frequency: 24.3993 34.7440 52.7844 80.6833 105.2866 130.0460 216.7114 223.8555 290.7829 349.4452 386.3420 527.2367 532.8358 593.7444 675.6320 708.4723 741.5233 855.2196 875.7104 888.2306 934.5530 1000.4172 1032.0728 1053.0085 1092.8456 1109.3526 1142.2558 1202.9801 1220.9435 1283.0766 1290.2681 1354.9241 1372.2078 1393.9988 1417.4906 1442.0743 1458.1260 1466.6992 1471.7908 1479.2345 1485.0161 1652.8053 1686.3609 2957.3993 2973.7922 2986.9895 3005.3860 3011.5352 3050.5561 3073.4142 3078.2363 3080.8883 3135.2934 3505.6802
redmass: 1.7869 1.2465 3.5829 2.7810 3.8753 3.1282 5.0982 1.0791 4.0527 4.0545 3.8396 4.2969 2.6226 2.6664 1.1262 4.9623 1.1844 3.2954 1.3663 3.2376 2.1923 2.2274 1.7199 2.4075 1.5433 2.6875 2.5540 2.9948 1.3406 1.5331 1.0865 1.6350 1.2337 1.2152 1.6150 1.0912 1.1491 1.0488 1.0545 1.0422 1.0769 4.6625 10.1159 1.0591 1.0363 1.0379 1.0987 1.0614 1.1001 1.0982 1.0985 1.1027 1.0984 1.0768
irintensity: 0.2276 0.1048 1.3990 1.3332 3.6046 0.1116 0.7825 0.0340 3.6894 2.2343 1.1638 15.3250 0.7653 2.5542 82.0216 0.0698 18.2211 11.3365 0.6104 9.0037 0.6611 14.4070 9.8671 8.5279 1.4871 17.5748 158.5358 162.3074 0.1333 27.3034 0.1417 10.8502 66.4260 11.2046 494.5797 51.4412 96.6618 22.1367 3.1603 13.6187 14.6985 6.3209 255.7208 21.0696 35.1461 6.6468 11.9661 15.9488 3.0488 13.7777 44.9478 73.9837 8.1266 8.2937
temp: 298.150 k
press: 1.00000 atm
elementType: 8 8 7 6 6 6 6 6 6 1 1 1 1 1 1 1 1 1 1 1
symmnumber: 1
zpe: 431824.1 jmol-1
zpe.correction: 0.164473 hartree
zpe.thermalcorrener: 0.175664 hartree
zpe.thermalcorrenthalpy: 0.176609 hartree
zpe.thermalcorrgfe: 0.125203 hartree
zpe.sumelectzpe: -439.735277 hartree
zpe.sumelectthermal: -439.724085 hartree
zpe.sumelectthermalent: -439.723141 hartree
zpe.sumelectthermalfe: -439.774547 hartree
dipole: -1.2234 -6.4753 0.0111
dipole: 6.5899
quadrupole: -52.6256 -59.4688 -53.4756
quadrupole: -9.0275 0.0665 -0.0240
quadrupole: 2.5644 -4.2788 1.7144 -9.0275 0.0665 -0.0240
hfenergy: -439.8997497 hartree
pointgroup: C01 [X(C6H11N1O2)]
dipole: 0.507029 2.5425577 0.0128644 debye
dipolederiv: -0.6160299 0.0070605 -0.0002565 0.327585 -0.8189123 0.0016478 -0.0014666 0.0004514 -0.2852684 -0.7241451 -0.082492 -0.0015633 -0.4042794 -0.7466297 -0.0052912 0.0003824 -0.0032424 -0.3018356 -2.1902701 0.2297642 -0.0025313 0.2281478 -0.4606257 0.0021931 -0.0047875 -0.0010159 -0.3681602 -0.3368262 -0.0840924 -0.0008334 -0.2517119 -0.1209193 -0.0011915 -0.0023721 -0.0010651 0.170342 0.1082919 -0.0043985 -0.0000861 -0.0491093 0.0627853 -0.0001383 0.0002277 0.0003446 0.1355218 1.7318746 -0.1682049 0.0045479 -0.6257367 1.1111762 -0.0035618 0.0073006 -0.0016991 0.1924436 -0.061021 -0.0406007 -0.0003161 -0.0046613 0.0582404 -0.0003141 -0.0000596 -0.0004845 0.1092249 1.9492922 -0.0312844 0.0001202 0.4617845 1.0228169 0.0111826 -0.0059744 0.0136871 0.2014355 -0.2719754 0.1783951 -0.0011296 0.2688806 -0.2851363 -0.0124963 0.0146282 -0.0251361 0.0524975 0.0264826 0.0052505 0.0232717 0.0387606 -0.0022606 -0.0996333 0.0315725 -0.1189846 -0.0428902 0.0259397 0.0055893 -0.0236086 0.0394712 -0.0042574 0.1002816 -0.0311704 0.1195949 -0.0413894 0.0415125 -0.017742 -0.0156476 0.0138459 -0.0025276 -0.1036539 -0.0096418 -0.112459 -0.0593994 0.0423005 -0.018238 0.0156687 0.0136895 -0.0042749 0.1039314 0.0100277 0.1124658 -0.0565944 -0.1590337 0.0901106 0.000399 0.1315132 0.0130296 -0.0004953 0.0005799 -0.0004893 0.103668 0.0775138 0.0033038 0.0255016 -0.0490082 -0.0164158 -0.1245558 -0.0222003 -0.1366715 -0.0935651 0.077517 0.0035658 -0.0253829 -0.0493921 -0.0194608 0.1253423 0.0217783 0.1375363 -0.0905491 0.1814293 -0.0240231 -0.0007732 -0.0193687 0.0718004 0.0002213 -0.000747 0.001689 0.2995934 0.0749956 -0.0273525 0.0764443 -0.0038938 0.0179279 0.0926457 0.0321068 0.1148576 -0.0137978 -0.066315 -0.0197957 -0.0127288 -0.0774777 0.0782045 -0.0068561 -0.0179418 0.0004519 0.1311568 0.0884666 -0.0048156 -0.0610958 0.0109608 0.0454393 -0.079258 -0.0222424 -0.0998312 -0.042434 unknown
polarizability: 102.8517552|-1.1588264|80.1166391|0.0432334|0.1335965|53.3848283 unknown
InChI: InChI=1S/C6H11NO2/c1-3-4-6(9)7-5(2)8/h7H,3-4H2,1-2H3
charge 0 multiplicity 1
20 atoms
O  0.251894 -1.532108 0.000469
O  -2.636577 -1.102584 -0.013495
N  -0.918031 0.519223 -0.005765
C  1.544893 0.568635 0.002928
C  2.826589 -0.287181 0.000121
C  0.262638 -0.280777 -0.0003
C  4.102686 0.579389 0.005829
C  -2.278333 0.096376 -0.010213
C  -3.258447 1.271816 0.001657
H  1.53501 1.2320 0.893492
H  1.535353 1.238801 -0.882525
H  2.815108 -0.949383 -0.884897
H  2.812854 -0.958312 0.878257
H  5.009045 -0.052315 0.002463
H  4.147284 1.225264 0.903418
H  4.148013 1.235805 -0.884034
H  -0.766114 1.532558 -0.005261
H  -3.07314 1.962282 -0.841872
H  -4.28188 0.877824 -0.076776
H  -3.171145 1.847187 0.942303
