program: Gaussian 09
title: 000031179
version: EM64L-G09RevD.01
frameworkgroup: C1[X(C8H17N)]
method: RPBEPBE
basis: SDD
operation: Freq
keyword: #pfreq=noraman
keyword: PBEPBE/SDD
title: #p freq=noraman PBEPBE/SDD
converged: YES YES NO NO
title: Mulliken charges:
elementType: N C C C C C C C C H H H H H H H H H H H H H H H H H
charge: -0.575107 -0.381792 -0.080674 -0.447501 -0.703426 -0.317604 0.378109 -0.790402 -0.817384 0.192193 0.185603 0.228655 0.193754 0.233921 0.209575 0.211834 0.200726 0.211900 0.252254 0.267430 0.214788 0.213418 0.224669 0.204332 0.273806 0.216924
chargesum: 0.00000
title: Mulliken charges with hydrogens summed into heavy atoms:
elementType: N C C C C C C C C
charge: -0.055423 -0.003996 0.147981 -0.019826 -0.081291 -0.105704 0.378109 -0.137527 -0.122323
polarizability: 1.08946023e+02 -9.50959534e+00 9.53397530e+01 -5.51976857e+00 1.33237786e+00 8.25377036e+01
1716.lowfreq: -4.5729 -0.0003 0.0003 0.0005 13.1262 19.2320 48.7016 67.7963 72.8204
frequency: 48.3265 67.7863 72.8015 150.5679 161.7237 193.8150 208.4544 231.7877 274.2138 306.7128 323.3205 369.6853 397.7428 439.9239 445.6995 510.0631 517.8217 685.7719 745.0173 793.8915 834.5786 870.1162 906.0052 939.5015 956.7461 993.5522 1000.1305 1010.0116 1032.0209 1076.8469 1083.6002 1095.4517 1148.7216 1155.7817 1195.4553 1243.1308 1272.1911 1297.9755 1317.4316 1342.5469 1356.1205 1373.8899 1377.6031 1386.8011 1399.3838 1454.8461 1456.8870 1458.7722 1467.1212 1471.0721 1471.5345 1473.4763 1494.7651 1633.4473 1691.6359 2950.1706 2951.5641 2955.7094 2958.8896 2977.9409 2996.0323 3020.5989 3022.1344 3025.4069 3052.9896 3058.7795 3061.6732 3070.5292 3076.1276 3084.1258 3410.8021 3537.1181
redmass: 2.6546 3.1790 2.8307 1.0639 1.9395 1.4741 1.6117 1.3309 1.0836 2.2798 2.2874 2.1965 2.2489 1.9561 2.2406 2.7729 2.0867 1.5247 2.2541 2.5914 1.3431 1.8075 1.6911 1.5874 1.3642 1.2486 2.3229 1.3512 1.8849 2.3027 1.6668 1.5968 1.5130 2.1334 1.8466 1.7610 1.4920 1.2257 1.3363 1.4463 1.4482 1.2707 1.2742 1.2732 1.2320 1.0795 1.0551 1.0743 1.0532 1.0606 1.0635 1.0701 1.0666 1.0926 6.3486 1.0608 1.0382 1.0374 1.0365 1.0666 1.0843 1.0985 1.0966 1.0962 1.0899 1.0990 1.0993 1.0962 1.0960 1.0979 1.0448 1.0957
irintensity: 0.1298 0.7164 0.9331 1.5117 2.1394 1.4074 1.4221 0.6077 38.3134 0.5738 1.3623 2.2912 6.4656 3.2979 11.3324 4.7621 1.4251 191.1466 2.2848 2.9232 30.4696 4.6167 1.4075 3.1897 1.9116 4.0928 5.2308 3.2176 4.3212 6.0249 5.1902 21.8577 8.0724 11.4891 13.3765 3.3534 3.0434 0.2404 0.9102 2.9208 4.1351 6.5595 12.6428 20.7007 14.4130 11.1888 1.5118 5.4901 8.5843 17.5724 23.8519 9.1858 8.1295 40.6421 3.5702 35.6218 22.3067 85.1726 42.1292 58.5764 14.6635 28.9783 2.9945 60.9419 9.5982 60.3417 38.0618 13.7562 73.0626 12.0991 3.9074 0.1687
temp: 298.150 k
press: 1.00000 atm
elementType: 7 6 6 6 6 6 6 6 6 1 1 1 1 1 1 1 1 1 1 1 1 1 1 1 1 1
symmnumber: 1
zpe: 615448.0 jmol-1
zpe.correction: 0.234412 hartree
zpe.thermalcorrener: 0.246436 hartree
zpe.thermalcorrenthalpy: 0.247380 hartree
zpe.thermalcorrgfe: 0.196813 hartree
zpe.sumelectzpe: -369.025278 hartree
zpe.sumelectthermal: -369.013253 hartree
zpe.sumelectthermalent: -369.012309 hartree
zpe.sumelectthermalfe: -369.062876 hartree
dipole: 1.3090 0.4970 0.5932
dipole: 1.5207
quadrupole: -54.5428 -55.7780 -59.1249
quadrupole: 1.0244 -2.3480 0.6658
quadrupole: 1.9391 0.7039 -2.6430 1.0244 -2.3480 0.6658
hfenergy: -369.2596893 hartree
pointgroup: C01 [X(C8H17N1)]
dipole: -0.518872 0.2370487 -0.1803216 debye
dipolederiv: -0.5656526 -0.0064637 -0.2462234 0.0027611 -0.4049738 -0.2269275 -0.2725124 -0.2022383 -0.5087998 0.0989443 0.0385112 -0.0790826 0.0513737 0.0510073 -0.0014701 0.0000476 0.0883293 0.0789894 0.2964202 -0.0702114 0.0605433 -0.0406064 0.349641 0.2147001 0.1445666 0.1600655 0.3727457 -0.0264776 -0.020235 0.0401139 0.0118683 0.0712912 0.0124966 0.0064218 -0.0907954 0.0809245 -0.0943255 -0.0172597 -0.1565787 0.0698946 0.0288306 -0.0253573 -0.1376862 -0.056939 -0.030678 -0.1072236 0.0609518 -0.1504805 -0.0339271 -0.0431645 0.1128963 -0.2759218 0.0942599 -0.1167113 0.1050877 0.0867638 -0.1833622 0.1157015 0.2101013 0.0929324 -0.1511611 0.1251127 0.051495 -0.0166429 0.0142977 0.1140213 -0.0361143 0.0299933 -0.0172469 0.0982307 -0.0592547 0.007751 -0.0315556 -0.0190777 0.0951123 0.0250556 -0.0915312 -0.1061265 0.0850211 -0.1105871 -0.0063144 0.0711784 0.0175953 -0.0200049 -0.0178969 -0.0661181 -0.1048337 -0.0509131 -0.1349781 -0.0663263 -0.1816008 -0.0695886 0.1419684 -0.0037968 0.0472485 0.0253285 0.126646 0.0701287 -0.0466986 -0.0331004 -0.0609268 0.0924561 -0.0846734 -0.0006158 0.0198451 0.09195 0.0022316 -0.0502287 -0.0095157 0.0108143 0.0009588 0.0317846 -0.1221979 0.1538327 0.0233024 0.1365418 -0.0239983 0.0576103 -0.0336897 -0.0000118 -0.0478866 0.015855 -0.1404162 0.0132097 -0.0750714 -0.0114649 0.0237191 0.0394106 -0.0368372 0.101279 -0.1395835 0.1128158 -0.0603666 0.0812729 0.0405074 0.067155 0.0198802 0.0143834 -0.0164535 -0.0307984 -0.1616918 -0.0190339 -0.1347436 -0.0897271 -0.0784489 -0.0463379 0.0642611 -0.0781995 0.0631942 0.0397713 0.1525999 0.0537327 -0.0260825 0.0682975 0.0021312 0.0697232 0.0220214 -0.0975901 -0.1196715 0.1081707 -0.1193882 0.0236987 0.0760949 -0.0165982 0.2038212 -0.0856732 0.1396021 0.0204949 0.1046043 -0.0174453 0.1885968 0.256821 0.1404669 0.0523138 0.0741185 0.0116602 0.0441742 0.0255724 0.1056019 0.1395557 -0.1811759 -0.0614335 -0.0293685 -0.0600615 0.0933661 -0.0322745 -0.0987561 -0.0173479 0.0304022 0.0549658 0.028691 -0.0174123 -0.0004903 -0.0318995 0.1543483 0.0686801 0.1259625 -0.0751999 0.0868953 -0.0259097 0.0040189 0.0526234 -0.1269041 -0.1285172 0.0384689 -0.0742443 0.0407082 0.1106449 -0.0031813 0.0057354 -0.0432247 -0.079465 0.0931243 0.0160995 0.156943 -0.04416 0.0509738 0.0543059 0.092589 0.0221339 0.0876008 -0.0148792 0.0985197 -0.0343799 0.0236336 -0.0990887 -0.0629068 -0.1326584 -0.0316115 0.0354502 -0.017348 -0.1357601 -0.0727696 0.0173816 unknown
polarizability: 109.0108088|9.2331455|94.5889716|-6.6532202|-0.7352548|83.2236995 unknown
InChI: InChI=1S/C8H17N/c1-7(2)5-4-6-8(3)9/h5,8H,4,6,9H2,1-3H3
charge 0 multiplicity 1
26 atoms
N  -1.816017 1.33466 0.892221
C  -1.422474 -1.059124 0.405883
C  -1.770302 0.322347 -0.198977
C  -0.018537 -1.105649 1.072332
C  -3.075912 0.25241 -1.034864
C  1.120183 -1.070759 0.069747
C  1.955145 -0.026842 -0.209601
C  3.068846 -0.169977 -1.236456
C  1.871441 1.33537 0.460439
H  -1.484065 -1.824947 -0.393086
H  -2.197247 -1.322074 1.15865
H  -0.936917 0.615908 -0.867411
H  0.057168 -2.042926 1.661061
H  0.047841 -0.265542 1.78491
H  -3.329924 1.243531 -1.45637
H  -2.979223 -0.461096 -1.875641
H  -3.925048 -0.078289 -0.404568
H  1.273033 -2.006461 -0.493435
H  -2.551899 1.130008 1.582082
H  -1.905568 2.297238 0.544354
H  4.05789 0.036907 -0.779825
H  2.946179 0.558304 -2.063452
H  3.09924 -1.184248 -1.67206
H  1.908639 2.140173 -0.301237
H  0.945629 1.464811 1.044791
H  2.740497 1.498566 1.130011
