program: Gaussian 09
title: 000031162
version: EM64L-G09RevD.01
frameworkgroup: C1[X(C9H9ClOS)]
method: RPBEPBE
basis: SDD
operation: Freq
keyword: #p
keyword: freq=noraman
keyword: PBEPBE/SDD
title: #p freq=noraman PBEPBE/SDD
converged: YES YES NO NO
title: Mulliken charges:
elementType: Cl S O C C C C C C C C C H H H H H H H H H
charge: -0.057755 0.147963 -0.233930 -0.514032 -0.667147 -0.250573 0.565512 -0.416064 -0.336768 -0.204534 -0.204940 -0.102845 0.276633 0.272627 0.259946 0.211646 0.241339 0.239067 0.261935 0.256781 0.255140
chargesum: 0.00000
title: Mulliken charges with hydrogens summed into heavy atoms:
elementType: Cl S O C C C C C C C C C
charge: -0.057755 0.147963 -0.233930 -0.237398 -0.134573 0.202412 0.565512 -0.176997 -0.074833 0.052247 0.050200 -0.102845
polarizability: 1.92538924e+02 5.36416653e+00 1.04740814e+02 3.50556431e-01 9.40648701e+00 8.02074978e+01
1716.lowfreq: -6.0202 -0.0041 -0.0034 -0.0032 8.2870 15.6519 35.4338 55.8370 64.7740
frequency: 34.7965 55.7734 64.7454 151.2906 159.4090 246.2132 265.7922 315.3758 340.3544 407.7372 425.6285 457.3640 512.8735 531.8114 618.1494 642.4842 655.6578 671.9689 723.1568 825.4034 829.4629 837.1754 856.7054 913.5512 949.1866 954.9972 972.7095 999.5935 1009.9744 1031.9101 1071.0288 1107.2644 1146.4378 1175.5718 1180.9750 1195.0946 1218.8023 1268.0118 1289.8091 1322.6113 1343.3801 1386.7153 1400.6787 1448.6174 1463.8960 1478.9646 1590.0384 1602.7501 2979.1113 3001.9237 3042.7922 3095.4620 3121.8503 3130.6000 3158.4227 3172.2832 3178.3928
redmass: 4.4509 4.0927 7.3972 4.4835 9.2996 7.9202 3.0486 5.2919 5.3188 2.9025 8.3647 6.0467 4.0974 3.8495 6.4594 5.3606 3.7961 5.6986 3.3735 2.4039 1.7237 1.5143 2.1182 2.5254 1.9849 1.7842 1.3651 3.9222 1.6475 3.3222 2.7266 1.3487 1.4270 1.1549 1.1207 1.2010 2.1594 1.1850 1.3045 1.5757 1.3757 5.9151 2.3688 1.0887 1.0937 2.5621 7.4230 6.2671 1.0661 1.0869 1.0566 1.0989 1.1100 1.0901 1.0885 1.0953 1.0974
irintensity: 0.3148 1.7786 1.2565 2.1682 2.9001 0.8212 4.6536 5.7914 6.5533 0.4719 14.3027 12.3399 3.6234 3.1880 12.0197 50.7835 1.8845 15.7633 15.3494 39.1770 12.3800 42.8305 4.9503 13.8398 14.0235 8.0476 0.0427 60.8328 10.5583 38.3789 41.5940 9.2617 10.8083 24.1513 3.4743 7.6214 17.2312 25.0113 7.2069 19.0915 2.3401 4.2175 9.9291 8.6590 4.9371 57.1133 2.4649 24.6985 70.4651 30.8362 28.4756 16.4524 17.1943 9.3696 1.4024 5.3977 1.4772
temp: 298.150 k
press: 1.00000 atm
elementType: 17 16 8 6 6 6 6 6 6 6 6 6 1 1 1 1 1 1 1 1 1
symmnumber: 1
zpe: 412907.5 jmol-1
zpe.correction: 0.157268 hartree
zpe.thermalcorrener: 0.168287 hartree
zpe.thermalcorrenthalpy: 0.169231 hartree
zpe.thermalcorrgfe: 0.118496 hartree
zpe.sumelectzpe: -1280.807144 hartree
zpe.sumelectthermal: -1280.796126 hartree
zpe.sumelectthermalent: -1280.795182 hartree
zpe.sumelectthermalfe: -1280.845916 hartree
dipole: -3.4462 -0.3227 0.9967
dipole: 3.6019
quadrupole: -78.3207 -80.9218 -87.0912
quadrupole: 5.5723 -1.1715 7.1133
quadrupole: 3.7905 1.1895 -4.9800 5.5723 -1.1715 7.1133
hfenergy: -1280.9644126 hartree
pointgroup: C01 [X(C9H9Cl1O1S1)]
dipole: 1.371845 -0.0293336 -0.3540662 debye
dipolederiv: -0.9317285 -0.0983947 0.0542059 -0.1119776 -0.1385836 0.0225702 0.0862215 0.0255404 -0.0836684 -0.4547638 -0.0441893 -0.1429572 0.0131191 -0.1732907 -0.0032218 -0.1683138 -0.0344629 -0.3598138 -0.8901016 0.1094846 0.0637442 0.1628086 -0.4824491 -0.1901435 0.0119438 -0.1463517 -0.6176556 1.0016672 -0.0037889 0.0807822 -0.0920136 0.4570956 0.1810459 0.0987833 0.1101989 0.764014 0.1063956 -0.0477229 0.0355107 -0.2326318 0.1694222 -0.1132577 -0.0805801 -0.0901148 -0.1488871 0.5759068 0.0079028 -0.0654752 0.1380941 0.2575771 -0.0759028 -0.0043493 0.0281967 0.4021195 -0.0151942 0.0072689 0.0774317 0.027618 -0.0837898 0.0109076 0.0796977 0.0218653 -0.0830811 0.0314129 0.0510987 -0.0488425 -0.0609356 0.0641429 -0.0670818 0.0185483 -0.0579558 -0.1232578 0.01116 -0.0598976 -0.0094423 0.0136329 0.0197069 -0.0539313 -0.0496067 -0.0310199 -0.086749 -0.3310061 -0.1280982 0.0371943 -0.167796 -0.0531197 -0.0167998 0.0789595 -0.0043578 -0.0931677 -0.3643634 0.0531126 -0.0140514 0.0495144 0.0143124 -0.0308257 0.0042308 -0.0412893 -0.0924553 1.2938527 0.1382439 -0.1104093 0.1806651 0.1498087 -0.0684667 -0.1426169 -0.0755452 -0.0387822 -0.0454826 -0.0120776 -0.0145148 0.0028722 -0.0812623 0.0565367 -0.0346 0.061767 -0.1162033 0.0250442 0.0155457 0.0252767 0.0909077 -0.1050796 0.0959279 0.0261607 0.0504916 0.0050413 -0.1491561 -0.03068 -0.0540819 0.0010733 0.0657753 0.0028254 -0.0290566 -0.0081424 0.0984211 -0.0722543 -0.0191096 0.0415412 -0.1576049 -0.0429402 0.1335889 0.0462605 0.0728587 -0.0367322 0.0171808 0.0433383 0.0145085 0.1182426 -0.0592999 -0.0721926 0.0549164 -0.0610383 0.0620266 0.050376 -0.0821491 0.0413051 -0.0708681 -0.0345297 0.0582454 0.0235689 0.0582265 0.121054 0.0611603 0.0774126 -0.0144825 0.0763805 0.0338169 0.0385745 -0.0343725 0.0300902 0.127394 0.0196211 0.0745653 -0.0176961 0.071802 0.0298063 0.0398347 -0.0112717 0.0374922 0.1555235 0.0602729 -0.0518655 0.0204527 -0.0529029 -0.0071196 0.0517666 0.0254762 0.0535505 0.1448596 unknown
polarizability: 192.6441237|-2.3992782|106.5632346|4.1409858|-5.8671628|78.2798777 unknown
InChI: InChI=1S/C9H9ClOS/c10-8-3-1-7(2-4-8)9-11-5-6-12-9/h1-4,9H,5-6H2
charge 0 multiplicity 1
21 atoms
Cl -4.623805 -0.382743 0.252542
S  2.279861 0.951188 1.337921
O  2.0829 -0.722776 -0.82898
C  1.418046 0.482683 -0.386549
C  3.656024 -0.300444 0.977777
C  3.520163 -0.6224 -0.52593
C  -0.060453 0.255596 -0.244657
C  -0.964109 1.311282 -0.516045
C  -0.565071 -0.999949 0.17607
C  -2.356717 1.129188 -0.361619
C  -1.952686 -1.202132 0.324185
C  -2.827453 -0.129337 0.056877
H  1.652384 1.33838 -1.047735
H  3.501508 -1.192844 1.603071
H  4.628714 0.164071 1.205773
H  3.983441 0.1804 -1.13558
H  3.954174 -1.598436 -0.794731
H  -0.586832 2.285363 -0.849638
H  0.135555 -1.816353 0.372787
H  -3.056531 1.943617 -0.568449
H  -2.348113 -2.171055 0.642309
